Run| Workspace| Log| Issues| Fixes| Pre-reqs| Stats| XRef| Maven Repository Proxy Log Gump Logo

Details

File Contents

Testsuite: org.apache.catalina.connector.TestConnector
Tests run: 12, Failures: 0, Errors: 0, Skipped: 0, Time elapsed: 1.873 sec
------------- Standard Error -----------------
21-Apr-2024 13:08:35.051 INFO [main] org.apache.catalina.startup.LoggingBaseTest.setUp Starting test case [testTraceAllowedCustom]
21-Apr-2024 13:08:35.428 INFO [main] org.apache.coyote.AbstractProtocol.init Initializing ProtocolHandler ["http-nio2-127.0.0.1-auto-1"]
21-Apr-2024 13:08:35.462 INFO [main] org.apache.catalina.core.StandardService.startInternal Starting service [Tomcat]
21-Apr-2024 13:08:35.462 INFO [main] org.apache.catalina.core.StandardEngine.startInternal Starting Servlet engine: [Apache Tomcat/11.0.0-M20-dev]
21-Apr-2024 13:08:35.530 INFO [main] org.apache.coyote.AbstractProtocol.start Starting ProtocolHandler ["http-nio2-127.0.0.1-auto-1-46209"]
21-Apr-2024 13:08:35.589 INFO [main] org.apache.coyote.AbstractProtocol.pause Pausing ProtocolHandler ["http-nio2-127.0.0.1-auto-1-46209"]
21-Apr-2024 13:08:35.591 INFO [main] org.apache.catalina.core.StandardService.stopInternal Stopping service [Tomcat]
21-Apr-2024 13:08:35.599 INFO [main] org.apache.coyote.AbstractProtocol.stop Stopping ProtocolHandler ["http-nio2-127.0.0.1-auto-1-46209"]
21-Apr-2024 13:08:35.600 INFO [main] org.apache.coyote.AbstractProtocol.destroy Destroying ProtocolHandler ["http-nio2-127.0.0.1-auto-1-46209"]
21-Apr-2024 13:08:35.607 INFO [main] org.apache.catalina.startup.LoggingBaseTest.setUp Starting test case [testTraceAllowedWebDav]
21-Apr-2024 13:08:35.614 INFO [main] org.apache.coyote.AbstractProtocol.init Initializing ProtocolHandler ["http-nio2-127.0.0.1-auto-2"]
21-Apr-2024 13:08:35.618 INFO [main] org.apache.catalina.core.StandardService.startInternal Starting service [Tomcat]
21-Apr-2024 13:08:35.618 INFO [main] org.apache.catalina.core.StandardEngine.startInternal Starting Servlet engine: [Apache Tomcat/11.0.0-M20-dev]
21-Apr-2024 13:08:35.624 INFO [main] org.apache.coyote.AbstractProtocol.start Starting ProtocolHandler ["http-nio2-127.0.0.1-auto-2-38435"]
21-Apr-2024 13:08:35.629 INFO [main] org.apache.coyote.AbstractProtocol.pause Pausing ProtocolHandler ["http-nio2-127.0.0.1-auto-2-38435"]
21-Apr-2024 13:08:35.630 INFO [main] org.apache.catalina.core.StandardService.stopInternal Stopping service [Tomcat]
21-Apr-2024 13:08:35.632 INFO [main] org.apache.coyote.AbstractProtocol.stop Stopping ProtocolHandler ["http-nio2-127.0.0.1-auto-2-38435"]
21-Apr-2024 13:08:35.632 INFO [main] org.apache.coyote.AbstractProtocol.destroy Destroying ProtocolHandler ["http-nio2-127.0.0.1-auto-2-38435"]
21-Apr-2024 13:08:35.634 INFO [main] org.apache.catalina.startup.LoggingBaseTest.setUp Starting test case [testDuplicatePortNoThrows]
21-Apr-2024 13:08:35.638 INFO [main] org.apache.coyote.AbstractProtocol.init Initializing ProtocolHandler ["http-nio-auto-3"]
21-Apr-2024 13:08:35.644 INFO [main] org.apache.coyote.AbstractProtocol.start Starting ProtocolHandler ["http-nio-auto-3-38105"]
21-Apr-2024 13:08:35.655 WARNING [main] org.apache.tomcat.util.net.AbstractEndpoint.getUtilityExecutor No utility executor was set, creating one
21-Apr-2024 13:08:35.656 INFO [main] org.apache.coyote.AbstractProtocol.init Initializing ProtocolHandler ["http-nio-38105"]
21-Apr-2024 13:08:35.656 SEVERE [main] org.apache.catalina.util.LifecycleBase.handleSubClassException Failed to initialize component [Connector["http-nio-38105"]]
	org.apache.catalina.LifecycleException: Protocol handler initialization failed
		at org.apache.catalina.connector.Connector.initInternal(Connector.java:1035)
		at org.apache.catalina.util.LifecycleBase.init(LifecycleBase.java:127)
		at org.apache.catalina.util.LifecycleBase.start(LifecycleBase.java:161)
		at org.apache.catalina.connector.TestConnector.doTestDuplicatePort(TestConnector.java:146)
		at org.apache.catalina.connector.TestConnector.testDuplicatePortNoThrows(TestConnector.java:132)
		at java.base/jdk.internal.reflect.DirectMethodHandleAccessor.invoke(DirectMethodHandleAccessor.java:103)
		at java.base/java.lang.reflect.Method.invoke(Method.java:580)
		at org.junit.runners.model.FrameworkMethod$1.runReflectiveCall(FrameworkMethod.java:59)
		at org.junit.internal.runners.model.ReflectiveCallable.run(ReflectiveCallable.java:12)
		at org.junit.runners.model.FrameworkMethod.invokeExplosively(FrameworkMethod.java:61)
		at org.junit.internal.runners.statements.InvokeMethod.evaluate(InvokeMethod.java:17)
		at org.junit.internal.runners.statements.RunBefores.evaluate(RunBefores.java:26)
		at org.junit.internal.runners.statements.RunAfters.evaluate(RunAfters.java:27)
		at org.junit.rules.TestWatcher$1.evaluate(TestWatcher.java:61)
		at org.junit.runners.ParentRunner$3.evaluate(ParentRunner.java:306)
		at org.junit.runners.BlockJUnit4ClassRunner$1.evaluate(BlockJUnit4ClassRunner.java:100)
		at org.junit.runners.ParentRunner.runLeaf(ParentRunner.java:366)
		at org.junit.runners.BlockJUnit4ClassRunner.runChild(BlockJUnit4ClassRunner.java:103)
		at org.junit.runners.BlockJUnit4ClassRunner.runChild(BlockJUnit4ClassRunner.java:63)
		at org.junit.runners.ParentRunner$4.run(ParentRunner.java:331)
		at org.junit.runners.ParentRunner$1.schedule(ParentRunner.java:79)
		at org.junit.runners.ParentRunner.runChildren(ParentRunner.java:329)
		at org.junit.runners.ParentRunner.access$100(ParentRunner.java:66)
		at org.junit.runners.ParentRunner$2.evaluate(ParentRunner.java:293)
		at org.junit.internal.runners.statements.RunBefores.evaluate(RunBefores.java:26)
		at org.junit.internal.runners.statements.RunAfters.evaluate(RunAfters.java:27)
		at org.junit.runners.ParentRunner$3.evaluate(ParentRunner.java:306)
		at org.junit.runners.ParentRunner.run(ParentRunner.java:413)
		at junit.framework.JUnit4TestAdapter.run(JUnit4TestAdapter.java:50)
		at org.apache.tools.ant.taskdefs.optional.junit.JUnitTestRunner.run(JUnitTestRunner.java:535)
		at org.apache.tools.ant.taskdefs.optional.junit.JUnitTestRunner.launch(JUnitTestRunner.java:1197)
		at org.apache.tools.ant.taskdefs.optional.junit.JUnitTestRunner.main(JUnitTestRunner.java:1042)
	Caused by: java.net.BindException: Address already in use
		at java.base/sun.nio.ch.Net.bind0(Native Method)
		at java.base/sun.nio.ch.Net.bind(Net.java:565)
		at java.base/sun.nio.ch.ServerSocketChannelImpl.netBind(ServerSocketChannelImpl.java:344)
		at java.base/sun.nio.ch.ServerSocketChannelImpl.bind(ServerSocketChannelImpl.java:301)
		at org.apache.tomcat.util.net.NioEndpoint.initServerSocket(NioEndpoint.java:240)
		at org.apache.tomcat.util.net.NioEndpoint.bind(NioEndpoint.java:195)
		at org.apache.tomcat.util.net.AbstractEndpoint.bindWithCleanup(AbstractEndpoint.java:1454)
		at org.apache.tomcat.util.net.AbstractEndpoint.init(AbstractEndpoint.java:1467)
		at org.apache.coyote.AbstractProtocol.init(AbstractProtocol.java:624)
		at org.apache.coyote.http11.AbstractHttp11Protocol.init(AbstractHttp11Protocol.java:78)
		at org.apache.catalina.connector.Connector.initInternal(Connector.java:1033)
		... 31 more
21-Apr-2024 13:08:35.657 INFO [main] org.apache.coyote.AbstractProtocol.start Starting ProtocolHandler ["http-nio-38105"]
21-Apr-2024 13:08:35.658 SEVERE [main] org.apache.catalina.util.LifecycleBase.handleSubClassException Failed to start component [Connector["http-nio-38105"]]
	org.apache.catalina.LifecycleException: Protocol handler start failed
		at org.apache.catalina.connector.Connector.startInternal(Connector.java:1066)
		at org.apache.catalina.util.LifecycleBase.start(LifecycleBase.java:171)
		at org.apache.catalina.connector.TestConnector.doTestDuplicatePort(TestConnector.java:146)
		at org.apache.catalina.connector.TestConnector.testDuplicatePortNoThrows(TestConnector.java:132)
		at java.base/jdk.internal.reflect.DirectMethodHandleAccessor.invoke(DirectMethodHandleAccessor.java:103)
		at java.base/java.lang.reflect.Method.invoke(Method.java:580)
		at org.junit.runners.model.FrameworkMethod$1.runReflectiveCall(FrameworkMethod.java:59)
		at org.junit.internal.runners.model.ReflectiveCallable.run(ReflectiveCallable.java:12)
		at org.junit.runners.model.FrameworkMethod.invokeExplosively(FrameworkMethod.java:61)
		at org.junit.internal.runners.statements.InvokeMethod.evaluate(InvokeMethod.java:17)
		at org.junit.internal.runners.statements.RunBefores.evaluate(RunBefores.java:26)
		at org.junit.internal.runners.statements.RunAfters.evaluate(RunAfters.java:27)
		at org.junit.rules.TestWatcher$1.evaluate(TestWatcher.java:61)
		at org.junit.runners.ParentRunner$3.evaluate(ParentRunner.java:306)
		at org.junit.runners.BlockJUnit4ClassRunner$1.evaluate(BlockJUnit4ClassRunner.java:100)
		at org.junit.runners.ParentRunner.runLeaf(ParentRunner.java:366)
		at org.junit.runners.BlockJUnit4ClassRunner.runChild(BlockJUnit4ClassRunner.java:103)
		at org.junit.runners.BlockJUnit4ClassRunner.runChild(BlockJUnit4ClassRunner.java:63)
		at org.junit.runners.ParentRunner$4.run(ParentRunner.java:331)
		at org.junit.runners.ParentRunner$1.schedule(ParentRunner.java:79)
		at org.junit.runners.ParentRunner.runChildren(ParentRunner.java:329)
		at org.junit.runners.ParentRunner.access$100(ParentRunner.java:66)
		at org.junit.runners.ParentRunner$2.evaluate(ParentRunner.java:293)
		at org.junit.internal.runners.statements.RunBefores.evaluate(RunBefores.java:26)
		at org.junit.internal.runners.statements.RunAfters.evaluate(RunAfters.java:27)
		at org.junit.runners.ParentRunner$3.evaluate(ParentRunner.java:306)
		at org.junit.runners.ParentRunner.run(ParentRunner.java:413)
		at junit.framework.JUnit4TestAdapter.run(JUnit4TestAdapter.java:50)
		at org.apache.tools.ant.taskdefs.optional.junit.JUnitTestRunner.run(JUnitTestRunner.java:535)
		at org.apache.tools.ant.taskdefs.optional.junit.JUnitTestRunner.launch(JUnitTestRunner.java:1197)
		at org.apache.tools.ant.taskdefs.optional.junit.JUnitTestRunner.main(JUnitTestRunner.java:1042)
	Caused by: java.net.BindException: Address already in use
		at java.base/sun.nio.ch.Net.bind0(Native Method)
		at java.base/sun.nio.ch.Net.bind(Net.java:565)
		at java.base/sun.nio.ch.ServerSocketChannelImpl.netBind(ServerSocketChannelImpl.java:344)
		at java.base/sun.nio.ch.ServerSocketChannelImpl.bind(ServerSocketChannelImpl.java:301)
		at org.apache.tomcat.util.net.NioEndpoint.initServerSocket(NioEndpoint.java:240)
		at org.apache.tomcat.util.net.NioEndpoint.bind(NioEndpoint.java:195)
		at org.apache.tomcat.util.net.AbstractEndpoint.bindWithCleanup(AbstractEndpoint.java:1454)
		at org.apache.tomcat.util.net.AbstractEndpoint.start(AbstractEndpoint.java:1540)
		at org.apache.coyote.AbstractProtocol.start(AbstractProtocol.java:635)
		at org.apache.catalina.connector.Connector.startInternal(Connector.java:1063)
		... 30 more
21-Apr-2024 13:08:35.658 INFO [main] org.apache.coyote.AbstractProtocol.destroy Destroying ProtocolHandler ["http-nio2-127.0.0.1-auto-4"]
21-Apr-2024 13:08:35.659 INFO [main] org.apache.catalina.startup.LoggingBaseTest.setUp Starting test case [testTraceNotAllowedDefault]
21-Apr-2024 13:08:35.660 INFO [main] org.apache.coyote.AbstractProtocol.init Initializing ProtocolHandler ["http-nio2-127.0.0.1-auto-5"]
21-Apr-2024 13:08:35.663 INFO [main] org.apache.catalina.core.StandardService.startInternal Starting service [Tomcat]
21-Apr-2024 13:08:35.663 INFO [main] org.apache.catalina.core.StandardEngine.startInternal Starting Servlet engine: [Apache Tomcat/11.0.0-M20-dev]
21-Apr-2024 13:08:35.669 INFO [main] org.apache.coyote.AbstractProtocol.start Starting ProtocolHandler ["http-nio2-127.0.0.1-auto-5-38369"]
21-Apr-2024 13:08:35.677 INFO [main] org.apache.coyote.AbstractProtocol.pause Pausing ProtocolHandler ["http-nio2-127.0.0.1-auto-5-38369"]
21-Apr-2024 13:08:35.677 INFO [main] org.apache.catalina.core.StandardService.stopInternal Stopping service [Tomcat]
21-Apr-2024 13:08:35.679 INFO [main] org.apache.coyote.AbstractProtocol.stop Stopping ProtocolHandler ["http-nio2-127.0.0.1-auto-5-38369"]
21-Apr-2024 13:08:35.679 INFO [main] org.apache.coyote.AbstractProtocol.destroy Destroying ProtocolHandler ["http-nio2-127.0.0.1-auto-5-38369"]
21-Apr-2024 13:08:35.682 INFO [main] org.apache.catalina.startup.LoggingBaseTest.setUp Starting test case [testTraceAllowedDefault]
21-Apr-2024 13:08:35.683 INFO [main] org.apache.coyote.AbstractProtocol.init Initializing ProtocolHandler ["http-nio2-127.0.0.1-auto-6"]
21-Apr-2024 13:08:35.685 INFO [main] org.apache.catalina.core.StandardService.startInternal Starting service [Tomcat]
21-Apr-2024 13:08:35.685 INFO [main] org.apache.catalina.core.StandardEngine.startInternal Starting Servlet engine: [Apache Tomcat/11.0.0-M20-dev]
21-Apr-2024 13:08:35.689 INFO [main] org.apache.coyote.AbstractProtocol.start Starting ProtocolHandler ["http-nio2-127.0.0.1-auto-6-42529"]
21-Apr-2024 13:08:35.691 INFO [main] org.apache.coyote.AbstractProtocol.pause Pausing ProtocolHandler ["http-nio2-127.0.0.1-auto-6-42529"]
21-Apr-2024 13:08:35.693 INFO [main] org.apache.catalina.core.StandardService.stopInternal Stopping service [Tomcat]
21-Apr-2024 13:08:35.694 INFO [main] org.apache.coyote.AbstractProtocol.stop Stopping ProtocolHandler ["http-nio2-127.0.0.1-auto-6-42529"]
21-Apr-2024 13:08:35.695 INFO [main] org.apache.coyote.AbstractProtocol.destroy Destroying ProtocolHandler ["http-nio2-127.0.0.1-auto-6-42529"]
21-Apr-2024 13:08:35.697 INFO [main] org.apache.catalina.startup.LoggingBaseTest.setUp Starting test case [testPort]
21-Apr-2024 13:08:35.698 INFO [main] org.apache.coyote.AbstractProtocol.init Initializing ProtocolHandler ["http-nio2-127.0.0.1-auto-7"]
21-Apr-2024 13:08:35.700 INFO [main] org.apache.coyote.AbstractProtocol.init Initializing ProtocolHandler ["http-nio-auto-8"]
21-Apr-2024 13:08:35.700 INFO [main] org.apache.catalina.core.StandardService.startInternal Starting service [Tomcat]
21-Apr-2024 13:08:35.700 INFO [main] org.apache.catalina.core.StandardEngine.startInternal Starting Servlet engine: [Apache Tomcat/11.0.0-M20-dev]
21-Apr-2024 13:08:35.701 INFO [main] org.apache.coyote.AbstractProtocol.start Starting ProtocolHandler ["http-nio2-127.0.0.1-auto-7-33095"]
21-Apr-2024 13:08:35.701 INFO [main] org.apache.coyote.AbstractProtocol.start Starting ProtocolHandler ["http-nio-auto-8-42737"]
21-Apr-2024 13:08:35.703 INFO [main] org.apache.coyote.AbstractProtocol.pause Pausing ProtocolHandler ["http-nio2-127.0.0.1-auto-7-33095"]
21-Apr-2024 13:08:35.703 INFO [main] org.apache.coyote.AbstractProtocol.pause Pausing ProtocolHandler ["http-nio-auto-8-42737"]
21-Apr-2024 13:08:35.704 INFO [main] org.apache.catalina.core.StandardService.stopInternal Stopping service [Tomcat]
21-Apr-2024 13:08:35.704 INFO [main] org.apache.coyote.AbstractProtocol.stop Stopping ProtocolHandler ["http-nio2-127.0.0.1-auto-7-33095"]
21-Apr-2024 13:08:35.704 INFO [main] org.apache.coyote.AbstractProtocol.stop Stopping ProtocolHandler ["http-nio-auto-8-42737"]
21-Apr-2024 13:08:35.706 INFO [main] org.apache.coyote.AbstractProtocol.destroy Destroying ProtocolHandler ["http-nio2-127.0.0.1-auto-7-33095"]
21-Apr-2024 13:08:35.707 INFO [main] org.apache.coyote.AbstractProtocol.destroy Destroying ProtocolHandler ["http-nio-auto-8-42737"]
21-Apr-2024 13:08:35.708 INFO [main] org.apache.catalina.startup.LoggingBaseTest.setUp Starting test case [testStop]
21-Apr-2024 13:08:35.709 INFO [main] org.apache.coyote.AbstractProtocol.init Initializing ProtocolHandler ["http-nio2-127.0.0.1-auto-9"]
21-Apr-2024 13:08:35.711 INFO [main] org.apache.catalina.core.StandardService.startInternal Starting service [Tomcat]
21-Apr-2024 13:08:35.711 INFO [main] org.apache.catalina.core.StandardEngine.startInternal Starting Servlet engine: [Apache Tomcat/11.0.0-M20-dev]
21-Apr-2024 13:08:35.714 INFO [main] org.apache.coyote.AbstractProtocol.start Starting ProtocolHandler ["http-nio2-127.0.0.1-auto-9-45869"]
21-Apr-2024 13:08:35.720 INFO [main] org.apache.coyote.AbstractProtocol.stop Stopping ProtocolHandler ["http-nio2-127.0.0.1-auto-9-45869"]
21-Apr-2024 13:08:36.724 INFO [main] org.apache.coyote.AbstractProtocol.pause Pausing ProtocolHandler ["http-nio2-127.0.0.1-auto-9-45869"]
21-Apr-2024 13:08:36.724 INFO [main] org.apache.catalina.core.StandardService.stopInternal Stopping service [Tomcat]
21-Apr-2024 13:08:36.728 INFO [main] org.apache.coyote.AbstractProtocol.destroy Destroying ProtocolHandler ["http-nio2-127.0.0.1-auto-9-45869"]
21-Apr-2024 13:08:36.730 INFO [main] org.apache.catalina.startup.LoggingBaseTest.setUp Starting test case [testInvalidProtocolNoThrows]
21-Apr-2024 13:08:36.731 SEVERE [main] org.apache.catalina.connector.Connector.<init> Protocol handler instantiation failed
	java.lang.ClassNotFoundException: foo.Bar
		at java.base/jdk.internal.loader.BuiltinClassLoader.loadClass(BuiltinClassLoader.java:641)
		at java.base/jdk.internal.loader.ClassLoaders$AppClassLoader.loadClass(ClassLoaders.java:188)
		at java.base/java.lang.ClassLoader.loadClass(ClassLoader.java:525)
		at java.base/java.lang.Class.forName0(Native Method)
		at java.base/java.lang.Class.forName(Class.java:422)
		at java.base/java.lang.Class.forName(Class.java:413)
		at org.apache.coyote.ProtocolHandler.create(ProtocolHandler.java:251)
		at org.apache.catalina.connector.Connector.<init>(Connector.java:80)
		at org.apache.catalina.connector.TestConnector.doTestInvalidProtocol(TestConnector.java:117)
		at org.apache.catalina.connector.TestConnector.testInvalidProtocolNoThrows(TestConnector.java:112)
		at java.base/jdk.internal.reflect.DirectMethodHandleAccessor.invoke(DirectMethodHandleAccessor.java:103)
		at java.base/java.lang.reflect.Method.invoke(Method.java:580)
		at org.junit.runners.model.FrameworkMethod$1.runReflectiveCall(FrameworkMethod.java:59)
		at org.junit.internal.runners.model.ReflectiveCallable.run(ReflectiveCallable.java:12)
		at org.junit.runners.model.FrameworkMethod.invokeExplosively(FrameworkMethod.java:61)
		at org.junit.internal.runners.statements.InvokeMethod.evaluate(InvokeMethod.java:17)
		at org.junit.internal.runners.statements.RunBefores.evaluate(RunBefores.java:26)
		at org.junit.internal.runners.statements.RunAfters.evaluate(RunAfters.java:27)
		at org.junit.rules.TestWatcher$1.evaluate(TestWatcher.java:61)
		at org.junit.runners.ParentRunner$3.evaluate(ParentRunner.java:306)
		at org.junit.runners.BlockJUnit4ClassRunner$1.evaluate(BlockJUnit4ClassRunner.java:100)
		at org.junit.runners.ParentRunner.runLeaf(ParentRunner.java:366)
		at org.junit.runners.BlockJUnit4ClassRunner.runChild(BlockJUnit4ClassRunner.java:103)
		at org.junit.runners.BlockJUnit4ClassRunner.runChild(BlockJUnit4ClassRunner.java:63)
		at org.junit.runners.ParentRunner$4.run(ParentRunner.java:331)
		at org.junit.runners.ParentRunner$1.schedule(ParentRunner.java:79)
		at org.junit.runners.ParentRunner.runChildren(ParentRunner.java:329)
		at org.junit.runners.ParentRunner.access$100(ParentRunner.java:66)
		at org.junit.runners.ParentRunner$2.evaluate(ParentRunner.java:293)
		at org.junit.internal.runners.statements.RunBefores.evaluate(RunBefores.java:26)
		at org.junit.internal.runners.statements.RunAfters.evaluate(RunAfters.java:27)
		at org.junit.runners.ParentRunner$3.evaluate(ParentRunner.java:306)
		at org.junit.runners.ParentRunner.run(ParentRunner.java:413)
		at junit.framework.JUnit4TestAdapter.run(JUnit4TestAdapter.java:50)
		at org.apache.tools.ant.taskdefs.optional.junit.JUnitTestRunner.run(JUnitTestRunner.java:535)
		at org.apache.tools.ant.taskdefs.optional.junit.JUnitTestRunner.launch(JUnitTestRunner.java:1197)
		at org.apache.tools.ant.taskdefs.optional.junit.JUnitTestRunner.main(JUnitTestRunner.java:1042)
21-Apr-2024 13:08:36.731 SEVERE [main] org.apache.catalina.util.LifecycleBase.handleSubClassException Failed to initialize component [Connector[foo.Bar-auto-null]]
	org.apache.catalina.LifecycleException: Protocol handler instantiation failed
		at org.apache.catalina.connector.Connector.initInternal(Connector.java:1000)
		at org.apache.catalina.util.LifecycleBase.init(LifecycleBase.java:127)

Continuation...

		at org.apache.catalina.util.LifecycleBase.start(LifecycleBase.java:161)
		at org.apache.catalina.connector.TestConnector.doTestInvalidProtocol(TestConnector.java:120)
		at org.apache.catalina.connector.TestConnector.testInvalidProtocolNoThrows(TestConnector.java:112)
		at java.base/jdk.internal.reflect.DirectMethodHandleAccessor.invoke(DirectMethodHandleAccessor.java:103)
		at java.base/java.lang.reflect.Method.invoke(Method.java:580)
		at org.junit.runners.model.FrameworkMethod$1.runReflectiveCall(FrameworkMethod.java:59)
		at org.junit.internal.runners.model.ReflectiveCallable.run(ReflectiveCallable.java:12)
		at org.junit.runners.model.FrameworkMethod.invokeExplosively(FrameworkMethod.java:61)
		at org.junit.internal.runners.statements.InvokeMethod.evaluate(InvokeMethod.java:17)
		at org.junit.internal.runners.statements.RunBefores.evaluate(RunBefores.java:26)
		at org.junit.internal.runners.statements.RunAfters.evaluate(RunAfters.java:27)
		at org.junit.rules.TestWatcher$1.evaluate(TestWatcher.java:61)
		at org.junit.runners.ParentRunner$3.evaluate(ParentRunner.java:306)
		at org.junit.runners.BlockJUnit4ClassRunner$1.evaluate(BlockJUnit4ClassRunner.java:100)
		at org.junit.runners.ParentRunner.runLeaf(ParentRunner.java:366)
		at org.junit.runners.BlockJUnit4ClassRunner.runChild(BlockJUnit4ClassRunner.java:103)
		at org.junit.runners.BlockJUnit4ClassRunner.runChild(BlockJUnit4ClassRunner.java:63)
		at org.junit.runners.ParentRunner$4.run(ParentRunner.java:331)
		at org.junit.runners.ParentRunner$1.schedule(ParentRunner.java:79)
		at org.junit.runners.ParentRunner.runChildren(ParentRunner.java:329)
		at org.junit.runners.ParentRunner.access$100(ParentRunner.java:66)
		at org.junit.runners.ParentRunner$2.evaluate(ParentRunner.java:293)
		at org.junit.internal.runners.statements.RunBefores.evaluate(RunBefores.java:26)
		at org.junit.internal.runners.statements.RunAfters.evaluate(RunAfters.java:27)
		at org.junit.runners.ParentRunner$3.evaluate(ParentRunner.java:306)
		at org.junit.runners.ParentRunner.run(ParentRunner.java:413)
		at junit.framework.JUnit4TestAdapter.run(JUnit4TestAdapter.java:50)
		at org.apache.tools.ant.taskdefs.optional.junit.JUnitTestRunner.run(JUnitTestRunner.java:535)
		at org.apache.tools.ant.taskdefs.optional.junit.JUnitTestRunner.launch(JUnitTestRunner.java:1197)
		at org.apache.tools.ant.taskdefs.optional.junit.JUnitTestRunner.main(JUnitTestRunner.java:1042)
21-Apr-2024 13:08:36.732 SEVERE [main] org.apache.catalina.util.LifecycleBase.handleSubClassException Failed to start component [Connector[foo.Bar-auto-null]]
	org.apache.catalina.LifecycleException: The connector cannot start since the specified port value of [-1] is invalid
		at org.apache.catalina.connector.Connector.startInternal(Connector.java:1052)
		at org.apache.catalina.util.LifecycleBase.start(LifecycleBase.java:171)
		at org.apache.catalina.connector.TestConnector.doTestInvalidProtocol(TestConnector.java:120)
		at org.apache.catalina.connector.TestConnector.testInvalidProtocolNoThrows(TestConnector.java:112)
		at java.base/jdk.internal.reflect.DirectMethodHandleAccessor.invoke(DirectMethodHandleAccessor.java:103)
		at java.base/java.lang.reflect.Method.invoke(Method.java:580)
		at org.junit.runners.model.FrameworkMethod$1.runReflectiveCall(FrameworkMethod.java:59)
		at org.junit.internal.runners.model.ReflectiveCallable.run(ReflectiveCallable.java:12)
		at org.junit.runners.model.FrameworkMethod.invokeExplosively(FrameworkMethod.java:61)
		at org.junit.internal.runners.statements.InvokeMethod.evaluate(InvokeMethod.java:17)
		at org.junit.internal.runners.statements.RunBefores.evaluate(RunBefores.java:26)
		at org.junit.internal.runners.statements.RunAfters.evaluate(RunAfters.java:27)
		at org.junit.rules.TestWatcher$1.evaluate(TestWatcher.java:61)
		at org.junit.runners.ParentRunner$3.evaluate(ParentRunner.java:306)
		at org.junit.runners.BlockJUnit4ClassRunner$1.evaluate(BlockJUnit4ClassRunner.java:100)
		at org.junit.runners.ParentRunner.runLeaf(ParentRunner.java:366)
		at org.junit.runners.BlockJUnit4ClassRunner.runChild(BlockJUnit4ClassRunner.java:103)
		at org.junit.runners.BlockJUnit4ClassRunner.runChild(BlockJUnit4ClassRunner.java:63)
		at org.junit.runners.ParentRunner$4.run(ParentRunner.java:331)
		at org.junit.runners.ParentRunner$1.schedule(ParentRunner.java:79)
		at org.junit.runners.ParentRunner.runChildren(ParentRunner.java:329)
		at org.junit.runners.ParentRunner.access$100(ParentRunner.java:66)
		at org.junit.runners.ParentRunner$2.evaluate(ParentRunner.java:293)
		at org.junit.internal.runners.statements.RunBefores.evaluate(RunBefores.java:26)
		at org.junit.internal.runners.statements.RunAfters.evaluate(RunAfters.java:27)
		at org.junit.runners.ParentRunner$3.evaluate(ParentRunner.java:306)
		at org.junit.runners.ParentRunner.run(ParentRunner.java:413)
		at junit.framework.JUnit4TestAdapter.run(JUnit4TestAdapter.java:50)
		at org.apache.tools.ant.taskdefs.optional.junit.JUnitTestRunner.run(JUnitTestRunner.java:535)
		at org.apache.tools.ant.taskdefs.optional.junit.JUnitTestRunner.launch(JUnitTestRunner.java:1197)
		at org.apache.tools.ant.taskdefs.optional.junit.JUnitTestRunner.main(JUnitTestRunner.java:1042)
21-Apr-2024 13:08:36.732 INFO [main] org.apache.coyote.AbstractProtocol.destroy Destroying ProtocolHandler ["http-nio2-127.0.0.1-auto-10"]
21-Apr-2024 13:08:36.733 INFO [main] org.apache.catalina.startup.LoggingBaseTest.setUp Starting test case [testTraceNotAllowedCustom]
21-Apr-2024 13:08:36.734 INFO [main] org.apache.coyote.AbstractProtocol.init Initializing ProtocolHandler ["http-nio2-127.0.0.1-auto-11"]
21-Apr-2024 13:08:36.736 INFO [main] org.apache.catalina.core.StandardService.startInternal Starting service [Tomcat]
21-Apr-2024 13:08:36.736 INFO [main] org.apache.catalina.core.StandardEngine.startInternal Starting Servlet engine: [Apache Tomcat/11.0.0-M20-dev]
21-Apr-2024 13:08:36.741 INFO [main] org.apache.coyote.AbstractProtocol.start Starting ProtocolHandler ["http-nio2-127.0.0.1-auto-11-33911"]
21-Apr-2024 13:08:36.743 INFO [main] org.apache.coyote.AbstractProtocol.pause Pausing ProtocolHandler ["http-nio2-127.0.0.1-auto-11-33911"]
21-Apr-2024 13:08:36.744 INFO [main] org.apache.catalina.core.StandardService.stopInternal Stopping service [Tomcat]
21-Apr-2024 13:08:36.746 INFO [main] org.apache.coyote.AbstractProtocol.stop Stopping ProtocolHandler ["http-nio2-127.0.0.1-auto-11-33911"]
21-Apr-2024 13:08:36.746 INFO [main] org.apache.coyote.AbstractProtocol.destroy Destroying ProtocolHandler ["http-nio2-127.0.0.1-auto-11-33911"]
21-Apr-2024 13:08:36.748 INFO [main] org.apache.catalina.startup.LoggingBaseTest.setUp Starting test case [testTraceNotAllowedWebDav]
21-Apr-2024 13:08:36.749 INFO [main] org.apache.coyote.AbstractProtocol.init Initializing ProtocolHandler ["http-nio2-127.0.0.1-auto-12"]
21-Apr-2024 13:08:36.751 INFO [main] org.apache.catalina.core.StandardService.startInternal Starting service [Tomcat]
21-Apr-2024 13:08:36.751 INFO [main] org.apache.catalina.core.StandardEngine.startInternal Starting Servlet engine: [Apache Tomcat/11.0.0-M20-dev]
21-Apr-2024 13:08:36.757 INFO [main] org.apache.coyote.AbstractProtocol.start Starting ProtocolHandler ["http-nio2-127.0.0.1-auto-12-34149"]
21-Apr-2024 13:08:36.758 INFO [main] org.apache.coyote.AbstractProtocol.pause Pausing ProtocolHandler ["http-nio2-127.0.0.1-auto-12-34149"]
21-Apr-2024 13:08:36.759 INFO [main] org.apache.catalina.core.StandardService.stopInternal Stopping service [Tomcat]
21-Apr-2024 13:08:36.760 INFO [main] org.apache.coyote.AbstractProtocol.stop Stopping ProtocolHandler ["http-nio2-127.0.0.1-auto-12-34149"]
21-Apr-2024 13:08:36.761 INFO [main] org.apache.coyote.AbstractProtocol.destroy Destroying ProtocolHandler ["http-nio2-127.0.0.1-auto-12-34149"]
21-Apr-2024 13:08:36.764 INFO [main] org.apache.catalina.startup.LoggingBaseTest.setUp Starting test case [testInvalidProtocolThrows]
21-Apr-2024 13:08:36.764 SEVERE [main] org.apache.catalina.connector.Connector.<init> Protocol handler instantiation failed
	java.lang.ClassNotFoundException: foo.Bar
		at java.base/jdk.internal.loader.BuiltinClassLoader.loadClass(BuiltinClassLoader.java:641)
		at java.base/jdk.internal.loader.ClassLoaders$AppClassLoader.loadClass(ClassLoaders.java:188)
		at java.base/java.lang.ClassLoader.loadClass(ClassLoader.java:525)
		at java.base/java.lang.Class.forName0(Native Method)
		at java.base/java.lang.Class.forName(Class.java:422)
		at java.base/java.lang.Class.forName(Class.java:413)
		at org.apache.coyote.ProtocolHandler.create(ProtocolHandler.java:251)
		at org.apache.catalina.connector.Connector.<init>(Connector.java:80)
		at org.apache.catalina.connector.TestConnector.doTestInvalidProtocol(TestConnector.java:117)
		at org.apache.catalina.connector.TestConnector.testInvalidProtocolThrows(TestConnector.java:106)
		at java.base/jdk.internal.reflect.DirectMethodHandleAccessor.invoke(DirectMethodHandleAccessor.java:103)
		at java.base/java.lang.reflect.Method.invoke(Method.java:580)
		at org.junit.runners.model.FrameworkMethod$1.runReflectiveCall(FrameworkMethod.java:59)
		at org.junit.internal.runners.model.ReflectiveCallable.run(ReflectiveCallable.java:12)
		at org.junit.runners.model.FrameworkMethod.invokeExplosively(FrameworkMethod.java:61)
		at org.junit.internal.runners.statements.InvokeMethod.evaluate(InvokeMethod.java:17)
		at org.junit.internal.runners.statements.ExpectException.evaluate(ExpectException.java:19)
		at org.junit.internal.runners.statements.RunBefores.evaluate(RunBefores.java:26)
		at org.junit.internal.runners.statements.RunAfters.evaluate(RunAfters.java:27)
		at org.junit.rules.TestWatcher$1.evaluate(TestWatcher.java:61)
		at org.junit.runners.ParentRunner$3.evaluate(ParentRunner.java:306)
		at org.junit.runners.BlockJUnit4ClassRunner$1.evaluate(BlockJUnit4ClassRunner.java:100)
		at org.junit.runners.ParentRunner.runLeaf(ParentRunner.java:366)
		at org.junit.runners.BlockJUnit4ClassRunner.runChild(BlockJUnit4ClassRunner.java:103)
		at org.junit.runners.BlockJUnit4ClassRunner.runChild(BlockJUnit4ClassRunner.java:63)
		at org.junit.runners.ParentRunner$4.run(ParentRunner.java:331)
		at org.junit.runners.ParentRunner$1.schedule(ParentRunner.java:79)
		at org.junit.runners.ParentRunner.runChildren(ParentRunner.java:329)
		at org.junit.runners.ParentRunner.access$100(ParentRunner.java:66)
		at org.junit.runners.ParentRunner$2.evaluate(ParentRunner.java:293)
		at org.junit.internal.runners.statements.RunBefores.evaluate(RunBefores.java:26)
		at org.junit.internal.runners.statements.RunAfters.evaluate(RunAfters.java:27)
		at org.junit.runners.ParentRunner$3.evaluate(ParentRunner.java:306)
		at org.junit.runners.ParentRunner.run(ParentRunner.java:413)
		at junit.framework.JUnit4TestAdapter.run(JUnit4TestAdapter.java:50)
		at org.apache.tools.ant.taskdefs.optional.junit.JUnitTestRunner.run(JUnitTestRunner.java:535)
		at org.apache.tools.ant.taskdefs.optional.junit.JUnitTestRunner.launch(JUnitTestRunner.java:1197)
		at org.apache.tools.ant.taskdefs.optional.junit.JUnitTestRunner.main(JUnitTestRunner.java:1042)
21-Apr-2024 13:08:36.765 INFO [main] org.apache.coyote.AbstractProtocol.destroy Destroying ProtocolHandler ["http-nio2-127.0.0.1-auto-13"]
21-Apr-2024 13:08:36.766 INFO [main] org.apache.catalina.startup.LoggingBaseTest.setUp Starting test case [testDuplicatePortThrows]
21-Apr-2024 13:08:36.766 INFO [main] org.apache.coyote.AbstractProtocol.init Initializing ProtocolHandler ["http-nio-auto-14"]
21-Apr-2024 13:08:36.767 INFO [main] org.apache.coyote.AbstractProtocol.start Starting ProtocolHandler ["http-nio-auto-14-35319"]
21-Apr-2024 13:08:36.776 WARNING [main] org.apache.tomcat.util.net.AbstractEndpoint.getUtilityExecutor No utility executor was set, creating one
21-Apr-2024 13:08:36.777 INFO [main] org.apache.coyote.AbstractProtocol.init Initializing ProtocolHandler ["http-nio-35319"]
21-Apr-2024 13:08:36.777 INFO [main] org.apache.coyote.AbstractProtocol.destroy Destroying ProtocolHandler ["http-nio2-127.0.0.1-auto-15"]
------------- ---------------- ---------------

Testcase: testTraceAllowedCustom took 0.664 sec
Testcase: testTraceAllowedWebDav took 0.027 sec
Testcase: testDuplicatePortNoThrows took 0.025 sec
Testcase: testTraceNotAllowedDefault took 0.022 sec
Testcase: testTraceAllowedDefault took 0.015 sec
Testcase: testPort took 0.011 sec
Testcase: testStop took 1.022 sec
Testcase: testInvalidProtocolNoThrows took 0.004 sec
Testcase: testTraceNotAllowedCustom took 0.015 sec
Testcase: testTraceNotAllowedWebDav took 0.015 sec
Testcase: testInvalidProtocolThrows took 0.002 sec
Testcase: testDuplicatePortThrows took 0.012 sec

Apache Gump, Gump, Apache, the Apache feather logo, and the Apache Gump project logos are trademarks of The Apache Software Foundation.

Last Updated: Sun, 21 Apr 2024 12:00:04 ().Python Logo