Run| Workspace| Log| Issues| Fixes| Pre-reqs| Stats| XRef| Maven Repository Proxy Log Gump Logo

Details

Parameters

Prefix Name Value
-D java.awt.headless true
-D build.sysclasspath only
org.apache.tools.ant.Main
-D gump.merge /srv/gump/public/gump/work/merge.xml
-D base.path /srv/gump/public/workspace/tomcat-trunk/tomcat-build-libs
-D checkstyle.jar /srv/gump/public/workspace/checkstyle/target/checkstyle-8.3-SNAPSHOT.jar
-D execute.validate true
validate

Environment Overrides

Name Value
CLASSPATH :/usr/lib/jvm/java-8-oracle/lib/tools.jar /srv/gump/public/workspace/ant/dist/lib/ant.jar /srv/gump/public/workspace/ant/dist/lib/ant-launcher.jar /srv/gump/public/workspace/ant/dist/lib/ant-jmf.jar /srv/gump/public/workspace/ant/dist/lib/ant-junit.jar /srv/gump/public/workspace/ant/dist/lib/ant-junit4.jar /srv/gump/public/workspace/ant/dist/lib/ant-swing.jar /srv/gump/public/workspace/ant/dist/lib/ant-apache-resolver.jar /srv/gump/public/workspace/ant/dist/lib/ant-apache-xalan2.jar /srv/gump/public/workspace/xml-commons/java/build/resolver.jar /srv/gump/public/workspace/checkstyle/target/checkstyle-8.3-SNAPSHOT.jar /srv/gump/packages/antlr/antlr-3.1.3.jar /srv/gump/public/workspace/apache-commons/beanutils/dist/commons-beanutils-20170926.jar /srv/gump/packages/commons-collections3/commons-collections-3.2.1.jar /srv/gump/public/workspace/commons-cli/target/commons-cli-1.5-SNAPSHOT.jar /srv/gump/public/workspace/commons-lang-trunk/target/commons-lang3-3.7-SNAPSHOT.jar /srv/gump/public/workspace/apache-commons/logging/target/commons-logging-20170926.jar /srv/gump/public/workspace/apache-commons/logging/target/commons-logging-api-20170926.jar /srv/gump/public/workspace/google-guava/guava/target/guava-24.0-jre-SNAPSHOT.jar

Command Line

/usr/lib/jvm/java-8-oracle/bin/java -Djava.awt.headless=true
        -Dbuild.sysclasspath=only org.apache.tools.ant.Main
        -Dgump.merge=/srv/gump/public/gump/work/merge.xml
        -Dbase.path=/srv/gump/public/workspace/tomcat-trunk/tomcat-build-libs
        -Dcheckstyle.jar=/srv/gump/public/workspace/checkstyle/target/checkstyle-8.3-SNAPSHOT.jar
        -Dexecute.validate=true validate 

Output

Buildfile: /srv/gump/public/workspace/tomcat-trunk/build.xml

build-prepare:
   [delete] Deleting directory /srv/gump/public/workspace/tomcat-trunk/output/build/temp
    [mkdir] Created dir: /srv/gump/public/workspace/tomcat-trunk/output/build/temp

compile-prepare:

download-validate:

testexist:
     [echo] Testing  for /srv/gump/public/workspace/checkstyle/target/checkstyle-8.3-SNAPSHOT.jar

setproxy:

downloadfile:

validate:
    [mkdir] Created dir: /srv/gump/public/workspace/tomcat-trunk/output/res/checkstyle
[checkstyle] Running Checkstyle 8.3-SNAPSHOT on 3161 files
[checkstyle] [ERROR] /srv/gump/public/workspace/tomcat-trunk/test/javax/el/TestCompositeELResolver.java:23: Extra separation in import group before 'org.junit.Test' [ImportOrder]
[checkstyle] [ERROR] /srv/gump/public/workspace/tomcat-trunk/test/javax/servlet/jsp/TestPageContext.java:21: Extra separation in import group before 'org.junit.Test' [ImportOrder]
[checkstyle] [ERROR] /srv/gump/public/workspace/tomcat-trunk/test/org/apache/catalina/ant/TestDeployTask.java:25: Extra separation in import group before 'org.junit.Test' [ImportOrder]
[checkstyle] [ERROR] /srv/gump/public/workspace/tomcat-trunk/test/org/apache/catalina/authenticator/TestDigestAuthenticator.java:29: Extra separation in import group before 'org.junit.Assert' [ImportOrder]
[checkstyle] [ERROR] /srv/gump/public/workspace/tomcat-trunk/test/org/apache/catalina/authenticator/TestFormAuthenticator.java:33: Extra separation in import group before 'org.junit.Test' [ImportOrder]
[checkstyle] [ERROR] /srv/gump/public/workspace/tomcat-trunk/test/org/apache/catalina/authenticator/TestNonLoginAndBasicAuthenticator.java:30: Extra separation in import group before 'org.junit.Test' [ImportOrder]
[checkstyle] [ERROR] /srv/gump/public/workspace/tomcat-trunk/test/org/apache/catalina/authenticator/TestSSOnonLoginAndBasicAuthenticator.java:32: Extra separation in import group before 'org.junit.Test' [ImportOrder]
[checkstyle] [ERROR] /srv/gump/public/workspace/tomcat-trunk/test/org/apache/catalina/authenticator/TestSSOnonLoginAndDigestAuthenticator.java:27: Extra separation in import group before 'org.junit.Test' [ImportOrder]
[checkstyle] [ERROR] /srv/gump/public/workspace/tomcat-trunk/test/org/apache/catalina/authenticator/TesterDigestAuthenticatorPerformance.java:26: Extra separation in import group before 'org.junit.Before' [ImportOrder]
[checkstyle] [ERROR] /srv/gump/public/workspace/tomcat-trunk/test/org/apache/catalina/connector/TestConnector.java:30: Extra separation in import group before 'org.junit.Assert' [ImportOrder]
[checkstyle] [ERROR] /srv/gump/public/workspace/tomcat-trunk/test/org/apache/catalina/connector/TestKeepAliveCount.java:28: Extra separation in import group before 'org.junit.Test' [ImportOrder]
[checkstyle] [ERROR] /srv/gump/public/workspace/tomcat-trunk/test/org/apache/catalina/connector/TestRequest.java:46: Extra separation in import group before 'org.junit.Assert' [ImportOrder]
[checkstyle] [ERROR] /srv/gump/public/workspace/tomcat-trunk/test/org/apache/catalina/connector/TestResponse.java:35: Extra separation in import group before 'org.junit.Assert' [ImportOrder]
[checkstyle] [ERROR] /srv/gump/public/workspace/tomcat-trunk/test/org/apache/catalina/connector/TestSendFile.java:41: Extra separation in import group before 'org.junit.Assert' [ImportOrder]
[checkstyle] [ERROR] /srv/gump/public/workspace/tomcat-trunk/test/org/apache/catalina/core/TestApplicationSessionCookieConfig.java:22: Extra separation in import group before 'org.junit.Before' [ImportOrder]
[checkstyle] [ERROR] /srv/gump/public/workspace/tomcat-trunk/test/org/apache/catalina/core/TestAsyncContextImpl.java:52: Extra separation in import group before 'org.junit.Assert' [ImportOrder]
[checkstyle] [ERROR] /srv/gump/public/workspace/tomcat-trunk/test/org/apache/catalina/core/TestDefaultInstanceManager.java:26: Extra separation in import group before 'org.junit.Ignore' [ImportOrder]
[checkstyle] [ERROR] /srv/gump/public/workspace/tomcat-trunk/test/org/apache/catalina/core/TestNamingContextListener.java:27: Extra separation in import group before 'org.junit.Test' [ImportOrder]
[checkstyle] [ERROR] /srv/gump/public/workspace/tomcat-trunk/test/org/apache/catalina/core/TestStandardContext.java:53: Extra separation in import group before 'org.junit.Assert' [ImportOrder]
[checkstyle] [ERROR] /srv/gump/public/workspace/tomcat-trunk/test/org/apache/catalina/core/TestStandardContextAliases.java:33: Extra separation in import group before 'org.junit.Test' [ImportOrder]
[checkstyle] [ERROR] /srv/gump/public/workspace/tomcat-trunk/test/org/apache/catalina/core/TestStandardContextResources.java:37: Extra separation in import group before 'org.junit.Test' [ImportOrder]
[checkstyle] [ERROR] /srv/gump/public/workspace/tomcat-trunk/test/org/apache/catalina/core/TestStandardWrapper.java:49: Extra separation in import group before 'org.junit.Test' [ImportOrder]
[checkstyle] [ERROR] /srv/gump/public/workspace/tomcat-trunk/test/org/apache/catalina/core/TestSwallowAbortedUploads.java:41: Extra separation in import group before 'org.junit.Assert' [ImportOrder]
[checkstyle] [ERROR] /srv/gump/public/workspace/tomcat-trunk/test/org/apache/catalina/filters/TestAddCharSetFilter.java:34: Extra separation in import group before 'org.junit.Test' [ImportOrder]
[checkstyle] [ERROR] /srv/gump/public/workspace/tomcat-trunk/test/org/apache/catalina/filters/TestCsrfPreventionFilter.java:31: Extra separation in import group before 'org.junit.Test' [ImportOrder]
[checkstyle] [ERROR] /srv/gump/public/workspace/tomcat-trunk/test/org/apache/catalina/filters/TestCsrfPreventionFilter2.java:22: Extra separation in import group before 'org.junit.Test' [ImportOrder]
[checkstyle] [ERROR] /srv/gump/public/workspace/tomcat-trunk/test/org/apache/catalina/filters/TestRemoteIpFilter.java:44: Extra separation in import group before 'org.junit.Assert' [ImportOrder]
[checkstyle] [ERROR] /srv/gump/public/workspace/tomcat-trunk/test/org/apache/catalina/filters/TestRestCsrfPreventionFilter.java:31: Extra separation in import group before 'org.junit.Before' [ImportOrder]
[checkstyle] [ERROR] /srv/gump/public/workspace/tomcat-trunk/test/org/apache/catalina/filters/TestRestCsrfPreventionFilter2.java:38: Extra separation in import group before 'org.junit.Test' [ImportOrder]
[checkstyle] [ERROR] /srv/gump/public/workspace/tomcat-trunk/test/org/apache/catalina/loader/TestVirtualContext.java:31: Extra separation in import group before 'org.junit.Assert' [ImportOrder]
[checkstyle] [ERROR] /srv/gump/public/workspace/tomcat-trunk/test/org/apache/catalina/loader/TestVirtualWebappLoader.java:25: Extra separation in import group before 'org.junit.Test' [ImportOrder]
[checkstyle] [ERROR] /srv/gump/public/workspace/tomcat-trunk/test/org/apache/catalina/loader/TestWebappClassLoaderMemoryLeak.java:30: Extra separation in import group before 'org.junit.Test' [ImportOrder]
[checkstyle] [ERROR] /srv/gump/public/workspace/tomcat-trunk/test/org/apache/catalina/loader/TestWebappClassLoaderWeaving.java:33: Extra separation in import group before 'org.junit.After' [ImportOrder]
[checkstyle] [ERROR] /srv/gump/public/workspace/tomcat-trunk/test/org/apache/catalina/mapper/TestMapper.java:30: Extra separation in import group before 'org.junit.Before' [ImportOrder]
[checkstyle] [ERROR] /srv/gump/public/workspace/tomcat-trunk/test/org/apache/catalina/mapper/TestMapperPerformance.java:21: Extra separation in import group before 'org.junit.Test' [ImportOrder]
[checkstyle] [ERROR] /srv/gump/public/workspace/tomcat-trunk/test/org/apache/catalina/mbeans/TestRegistration.java:35: Extra separation in import group before 'org.junit.Assert' [ImportOrder]
[checkstyle] [ERROR] /srv/gump/public/workspace/tomcat-trunk/test/org/apache/catalina/servlets/TestDefaultServlet.java:39: Extra separation in import group before 'org.junit.Assert' [ImportOrder]
[checkstyle] [ERROR] /srv/gump/public/workspace/tomcat-trunk/test/org/apache/catalina/servlets/TestDefaultServlet.java:44: Extra separation in import group before 'org.apache.catalina.Context' [ImportOrder]
[checkstyle] [ERROR] /srv/gump/public/workspace/tomcat-trunk/test/org/apache/catalina/servlets/TestWebdavServlet.java:28: Extra separation in import group before 'org.junit.Test' [ImportOrder]
[checkstyle] [ERROR] /srv/gump/public/workspace/tomcat-trunk/test/org/apache/catalina/session/Benchmarks.java:27: Extra separation in import group before 'org.junit.Test' [ImportOrder]
[checkstyle] [ERROR] /srv/gump/public/workspace/tomcat-trunk/test/org/apache/catalina/session/Threading.java:25: Extra separation in import group before 'org.junit.Test' [ImportOrder]
[checkstyle] [ERROR] /srv/gump/public/workspace/tomcat-trunk/test/org/apache/catalina/startup/LoggingBaseTest.java:29: Extra separation in import group before 'org.junit.After' [ImportOrder]
[checkstyle] [ERROR] /srv/gump/public/workspace/tomcat-trunk/test/org/apache/catalina/startup/TestBootstrap.java:21: Extra separation in import group before 'org.junit.Test' [ImportOrder]
[checkstyle] [ERROR] /srv/gump/public/workspace/tomcat-trunk/test/org/apache/catalina/startup/TestContextConfigAnnotation.java:40: Extra separation in import group before 'org.junit.Test' [ImportOrder]
[checkstyle] [ERROR] /srv/gump/public/workspace/tomcat-trunk/test/org/apache/catalina/startup/TestListener.java:30: Extra separation in import group before 'org.junit.Test' [ImportOrder]
[checkstyle] [ERROR] /srv/gump/public/workspace/tomcat-trunk/test/org/apache/catalina/startup/TestTomcat.java:42: Extra separation in import group before 'org.junit.Assert' [ImportOrder]
[checkstyle] [ERROR] /srv/gump/public/workspace/tomcat-trunk/test/org/apache/catalina/startup/TestTomcatClassLoader.java:31: Extra separation in import group before 'org.junit.Test' [ImportOrder]
[checkstyle] [ERROR] /srv/gump/public/workspace/tomcat-trunk/test/org/apache/catalina/startup/TomcatBaseTest.java:47: Extra separation in import group before 'org.junit.After' [ImportOrder]
[checkstyle] [ERROR] /srv/gump/public/workspace/tomcat-trunk/test/org/apache/catalina/tribes/group/TestGroupChannelOptionFlag.java:22: Extra separation in import group before 'org.junit.After' [ImportOrder]
[checkstyle] [ERROR] /srv/gump/public/workspace/tomcat-trunk/test/org/apache/catalina/tribes/group/TestGroupChannelSenderConnections.java:27: Extra separation in import group before 'org.junit.After' [ImportOrder]
[checkstyle] [ERROR] /srv/gump/public/workspace/tomcat-trunk/test/org/apache/catalina/tribes/group/TestGroupChannelStartStop.java:21: Extra separation in import group before 'org.junit.After' [ImportOrder]
[checkstyle] [ERROR] /srv/gump/public/workspace/tomcat-trunk/test/org/apache/catalina/tribes/group/interceptors/TestDomainFilterInterceptor.java:23: Extra separation in import group before 'org.junit.After' [ImportOrder]
[checkstyle] [ERROR] /srv/gump/public/workspace/tomcat-trunk/test/org/apache/catalina/tribes/group/interceptors/TestGzipInterceptor.java:26: Extra separation in import group before 'org.junit.Test' [ImportOrder]
[checkstyle] [ERROR] /srv/gump/public/workspace/tomcat-trunk/test/org/apache/catalina/tribes/group/interceptors/TestNonBlockingCoordinator.java:21: Extra separation in import group before 'org.junit.After' [ImportOrder]
[checkstyle] [ERROR] /srv/gump/public/workspace/tomcat-trunk/test/org/apache/catalina/tribes/group/interceptors/TestOrderInterceptor.java:27: Extra separation in import group before 'org.junit.After' [ImportOrder]
[checkstyle] [ERROR] /srv/gump/public/workspace/tomcat-trunk/test/org/apache/catalina/tribes/group/interceptors/TestTcpFailureDetector.java:24: Extra separation in import group before 'org.junit.After' [ImportOrder]
[checkstyle] [ERROR] /srv/gump/public/workspace/tomcat-trunk/test/org/apache/catalina/tribes/io/TestXByteBuffer.java:23: Extra separation in import group before 'org.junit.Test' [ImportOrder]
[checkstyle] [ERROR] /srv/gump/public/workspace/tomcat-trunk/test/org/apache/catalina/tribes/membership/TestMemberImplSerialization.java:24: Extra separation in import group before 'org.junit.Before' [ImportOrder]
[checkstyle] [ERROR] /srv/gump/public/workspace/tomcat-trunk/test/org/apache/catalina/tribes/test/channel/TestChannelConfig.java:21: Extra separation in import group before 'org.junit.Test' [ImportOrder]
[checkstyle] [ERROR] /srv/gump/public/workspace/tomcat-trunk/test/org/apache/catalina/tribes/test/channel/TestDataIntegrity.java:25: Extra separation in import group before 'org.junit.After' [ImportOrder]
[checkstyle] [ERROR] /srv/gump/public/workspace/tomcat-trunk/test/org/apache/catalina/tribes/test/channel/TestMulticastPackages.java:27: Extra separation in import group before 'org.junit.After' [ImportOrder]
[checkstyle] [ERROR] /srv/gump/public/workspace/tomcat-trunk/test/org/apache/catalina/tribes/test/channel/TestRemoteProcessException.java:27: Extra separation in import group before 'org.junit.After' [ImportOrder]
[checkstyle] [ERROR] /srv/gump/public/workspace/tomcat-trunk/test/org/apache/catalina/tribes/test/channel/TestUdpPackages.java:27: Extra separation in import group before 'org.junit.After' [ImportOrder]
[checkstyle] [ERROR] /srv/gump/public/workspace/tomcat-trunk/test/org/apache/catalina/util/TestContextName.java:21: Extra separation in import group before 'org.junit.Before' [ImportOrder]
[checkstyle] [ERROR] /srv/gump/public/workspace/tomcat-trunk/test/org/apache/catalina/valves/TestRemoteIpValve.java:33: Extra separation in import group before 'org.junit.Assert' [ImportOrder]
[checkstyle] [ERROR] /srv/gump/public/workspace/tomcat-trunk/test/org/apache/catalina/valves/TestRequestFilterValve.java:27: Extra separation in import group before 'org.junit.Assert' [ImportOrder]
[checkstyle] [ERROR] /srv/gump/public/workspace/tomcat-trunk/test/org/apache/coyote/http11/TestHttp11InputBuffer.java:33: Extra separation in import group before 'org.junit.Test' [ImportOrder]
[checkstyle] [ERROR] /srv/gump/public/workspace/tomcat-trunk/test/org/apache/coyote/http11/TestHttp11Processor.java:53: Extra separation in import group before 'org.junit.Assert' [ImportOrder]
[checkstyle] [ERROR] /srv/gump/public/workspace/tomcat-trunk/test/org/apache/coyote/http11/filters/TestChunkedInputFilter.java:34: Extra separation in import group before 'org.junit.Test' [ImportOrder]
[checkstyle] [ERROR] /srv/gump/public/workspace/tomcat-trunk/test/org/apache/coyote/http11/filters/TestGzipOutputFilter.java:26: Extra separation in import group before 'org.junit.Test' [ImportOrder]
[checkstyle] [ERROR] /srv/gump/public/workspace/tomcat-trunk/test/org/apache/coyote/http11/upgrade/TestUpgrade.java:47: Extra separation in import group before 'org.apache.catalina.Context' [ImportOrder]
[checkstyle] [ERROR] /srv/gump/public/workspace/tomcat-trunk/test/org/apache/coyote/http11/upgrade/TestUpgradeInternalHandler.java:46: Extra separation in import group before 'org.apache.catalina.Context' [ImportOrder]
[checkstyle] [ERROR] /srv/gump/public/workspace/tomcat-trunk/test/org/apache/el/TestELEvaluation.java:31: Extra separation in import group before 'org.junit.Assert' [ImportOrder]
[checkstyle] [ERROR] /srv/gump/public/workspace/tomcat-trunk/test/org/apache/el/TestMethodExpressionImpl.java:30: Extra separation in import group before 'org.junit.Before' [ImportOrder]
[checkstyle] [ERROR] /srv/gump/public/workspace/tomcat-trunk/test/org/apache/el/TestValueExpressionImpl.java:34: Extra separation in import group before 'org.junit.Test' [ImportOrder]
[checkstyle] [ERROR] /srv/gump/public/workspace/tomcat-trunk/test/org/apache/el/lang/TestELArithmetic.java:26: Extra separation in import group before 'org.junit.Assert' [ImportOrder]
[checkstyle] [ERROR] /srv/gump/public/workspace/tomcat-trunk/test/org/apache/el/lang/TestELSupport.java:30: Extra separation in import group before 'org.junit.Assert' [ImportOrder]
[checkstyle] [ERROR] /srv/gump/public/workspace/tomcat-trunk/test/org/apache/el/parser/TestELParser.java:30: Extra separation in import group before 'org.junit.Ignore' [ImportOrder]
[checkstyle] [ERROR] /srv/gump/public/workspace/tomcat-trunk/test/org/apache/jasper/compiler/TestAttributeParser.java:24: Extra separation in import group before 'org.junit.Test' [ImportOrder]
[checkstyle] [ERROR] /srv/gump/public/workspace/tomcat-trunk/test/org/apache/jasper/compiler/TestCompiler.java:29: Extra separation in import group before 'org.junit.Test' [ImportOrder]
[checkstyle] [ERROR] /srv/gump/public/workspace/tomcat-trunk/test/org/apache/jasper/compiler/TestGenerator.java:36: Extra separation in import group before 'org.junit.Assert' [ImportOrder]
[checkstyle] [ERROR] /srv/gump/public/workspace/tomcat-trunk/test/org/apache/jasper/compiler/TestJspConfig.java:24: Extra separation in import group before 'org.junit.Test' [ImportOrder]
[checkstyle] [ERROR] /srv/gump/public/workspace/tomcat-trunk/test/org/apache/jasper/compiler/TestParser.java:25: Extra separation in import group before 'org.junit.Assert' [ImportOrder]
[checkstyle] [ERROR] /srv/gump/public/workspace/tomcat-trunk/test/org/apache/jasper/compiler/TestParserNoStrictWhitespace.java:26: Extra separation in import group before 'org.junit.Test' [ImportOrder]
[checkstyle] [ERROR] /srv/gump/public/workspace/tomcat-trunk/test/org/apache/jasper/compiler/TestScriptingVariabler.java:29: Extra separation in import group before 'org.junit.Test' [ImportOrder]
[checkstyle] [ERROR] /srv/gump/public/workspace/tomcat-trunk/test/org/apache/jasper/compiler/TestValidator.java:30: Extra separation in import group before 'org.junit.Test' [ImportOrder]
[checkstyle] [ERROR] /srv/gump/public/workspace/tomcat-trunk/test/org/apache/jasper/util/TestFastRemovalDequeue.java:22: Extra separation in import group before 'org.junit.Test' [ImportOrder]
[checkstyle] [ERROR] /srv/gump/public/workspace/tomcat-trunk/test/org/apache/juli/TestFileHandler.java:31: Extra separation in import group before 'org.junit.After' [ImportOrder]
[checkstyle] [ERROR] /srv/gump/public/workspace/tomcat-trunk/test/org/apache/juli/TestFileHandlerNonRotatable.java:24: Extra separation in import group before 'org.junit.After' [ImportOrder]
[checkstyle] [ERROR] /srv/gump/public/workspace/tomcat-trunk/test/org/apache/naming/resources/TestNamingContext.java:37: Extra separation in import group before 'org.junit.Assert' [ImportOrder]
[checkstyle] [ERROR] /srv/gump/public/workspace/tomcat-trunk/test/org/apache/naming/resources/TestWarDirContext.java:23: Extra separation in import group before 'org.junit.Test' [ImportOrder]
[checkstyle] [ERROR] /srv/gump/public/workspace/tomcat-trunk/test/org/apache/tomcat/util/buf/TestByteChunk.java:26: Extra separation in import group before 'org.junit.Test' [ImportOrder]
[checkstyle] [ERROR] /srv/gump/public/workspace/tomcat-trunk/test/org/apache/tomcat/util/buf/TestCharChunk.java:23: Extra separation in import group before 'org.junit.Test' [ImportOrder]
[checkstyle] [ERROR] /srv/gump/public/workspace/tomcat-trunk/test/org/apache/tomcat/util/buf/TestUDecoder.java:24: Extra separation in import group before 'org.junit.Test' [ImportOrder]
[checkstyle] [ERROR] /srv/gump/public/workspace/tomcat-trunk/test/org/apache/tomcat/util/descriptor/web/TestSecurityConstraint.java:33: Extra separation in import group before 'org.junit.Assert' [ImportOrder]
[checkstyle] [ERROR] /srv/gump/public/workspace/tomcat-trunk/test/org/apache/tomcat/util/descriptor/web/TestWebRuleSet.java:27: Extra separation in import group before 'org.junit.Test' [ImportOrder]
[checkstyle] [ERROR] /srv/gump/public/workspace/tomcat-trunk/test/org/apache/tomcat/util/descriptor/web/TestWebXmlOrdering.java:31: Extra separation in import group before 'org.junit.Before' [ImportOrder]
[checkstyle] [ERROR] /srv/gump/public/workspace/tomcat-trunk/test/org/apache/tomcat/util/http/TestBug49158.java:33: Extra separation in import group before 'org.junit.Test' [ImportOrder]

Continuation...

[checkstyle] [ERROR] /srv/gump/public/workspace/tomcat-trunk/test/org/apache/tomcat/util/http/TestCookiesDefaultSysProps.java:25: Extra separation in import group before 'org.junit.Test' [ImportOrder]
[checkstyle] [ERROR] /srv/gump/public/workspace/tomcat-trunk/test/org/apache/tomcat/util/http/TestCookiesNoFwdStrictSysProps.java:21: Extra separation in import group before 'org.junit.Test' [ImportOrder]
[checkstyle] [ERROR] /srv/gump/public/workspace/tomcat-trunk/test/org/apache/tomcat/util/http/TestCookiesNoStrictNamingSysProps.java:21: Extra separation in import group before 'org.junit.Test' [ImportOrder]
[checkstyle] [ERROR] /srv/gump/public/workspace/tomcat-trunk/test/org/apache/tomcat/util/http/TestCookiesStrictSysProps.java:25: Extra separation in import group before 'org.junit.Test' [ImportOrder]
[checkstyle] [ERROR] /srv/gump/public/workspace/tomcat-trunk/test/org/apache/tomcat/util/http/TestMimeHeadersIntegration.java:32: Extra separation in import group before 'org.junit.Test' [ImportOrder]
[checkstyle] [ERROR] /srv/gump/public/workspace/tomcat-trunk/test/org/apache/tomcat/util/http/TestParameters.java:31: Extra separation in import group before 'org.junit.Test' [ImportOrder]
[checkstyle] [ERROR] /srv/gump/public/workspace/tomcat-trunk/test/org/apache/tomcat/util/http/TestRequestUtil.java:21: Extra separation in import group before 'org.junit.Test' [ImportOrder]
[checkstyle] [ERROR] /srv/gump/public/workspace/tomcat-trunk/test/org/apache/tomcat/util/http/parser/TestMediaType.java:26: Extra separation in import group before 'org.junit.Assert' [ImportOrder]
[checkstyle] [ERROR] /srv/gump/public/workspace/tomcat-trunk/test/org/apache/tomcat/util/net/TestClientCert.java:24: Extra separation in import group before 'org.junit.Assume' [ImportOrder]
[checkstyle] [ERROR] /srv/gump/public/workspace/tomcat-trunk/test/org/apache/tomcat/util/net/TestCustomSsl.java:28: Extra separation in import group before 'org.junit.Assume' [ImportOrder]
[checkstyle] [ERROR] /srv/gump/public/workspace/tomcat-trunk/test/org/apache/tomcat/util/net/TestSsl.java:34: Extra separation in import group before 'org.junit.Assert' [ImportOrder]
[checkstyle] [ERROR] /srv/gump/public/workspace/tomcat-trunk/test/org/apache/tomcat/util/net/TestXxxEndpoint.java:28: Extra separation in import group before 'org.junit.Test' [ImportOrder]
[checkstyle] [ERROR] /srv/gump/public/workspace/tomcat-trunk/test/org/apache/tomcat/util/net/openssl/TestOpenSSLConf.java:30: Extra separation in import group before 'org.junit.Assume' [ImportOrder]
[checkstyle] [ERROR] /srv/gump/public/workspace/tomcat-trunk/test/org/apache/tomcat/util/res/TestStringManager.java:22: Extra separation in import group before 'org.junit.Test' [ImportOrder]
[checkstyle] [ERROR] /srv/gump/public/workspace/tomcat-trunk/test/org/apache/tomcat/util/scan/TestJarScanner.java:27: Extra separation in import group before 'org.junit.Test' [ImportOrder]
[checkstyle] [ERROR] /srv/gump/public/workspace/tomcat-trunk/modules/jdbc-pool/src/test/java/org/apache/tomcat/jdbc/bugs/Bug54225.java:25: Extra separation in import group before 'org.junit.Test' [ImportOrder]
[checkstyle] [ERROR] /srv/gump/public/workspace/tomcat-trunk/modules/jdbc-pool/src/test/java/org/apache/tomcat/jdbc/bugs/Bug54227.java:27: Extra separation in import group before 'org.junit.Test' [ImportOrder]
[checkstyle] [ERROR] /srv/gump/public/workspace/tomcat-trunk/modules/jdbc-pool/src/test/java/org/apache/tomcat/jdbc/bugs/Bug54978.java:23: Extra separation in import group before 'org.junit.Test' [ImportOrder]
[checkstyle] [ERROR] /srv/gump/public/workspace/tomcat-trunk/modules/jdbc-pool/src/test/java/org/apache/tomcat/jdbc/pool/ShouldForceReconnectTest.java:22: Extra separation in import group before 'org.junit.After' [ImportOrder]
[checkstyle] [ERROR] /srv/gump/public/workspace/tomcat-trunk/modules/jdbc-pool/src/test/java/org/apache/tomcat/jdbc/test/TestJdbcInterceptorConfigParsing.java:25: Extra separation in import group before 'org.junit.Test' [ImportOrder]
[checkstyle] [ERROR] /srv/gump/public/workspace/tomcat-trunk/modules/jdbc-pool/src/test/java/org/apache/tomcat/jdbc/test/TestValidationQueryTimeout.java:31: Extra separation in import group before 'org.junit.After' [ImportOrder]

BUILD FAILED
/srv/gump/public/workspace/tomcat-trunk/build.xml:546: Got 119 errors and 0 warnings.

Total time: 33 seconds

Apache Gump, Gump, Apache, the Apache feather logo, and the Apache Gump project logos are trademarks of The Apache Software Foundation.

Last Updated: Tue, 26 Sep 2017 12:00:07 ().Python Logo