Run| Workspace| Log| Issues| Fixes| Pre-reqs| Stats| XRef| Maven Repository Proxy Log Gump Logo

Details

File Contents

Testsuite: org.apache.catalina.core.TestStandardContext
Tests run: 23, Failures: 0, Errors: 0, Skipped: 0, Time elapsed: 3.955 sec
------------- Standard Error -----------------
21-Nov-2017 15:39:32.924 INFO [main] org.apache.catalina.startup.LoggingBaseTest.setUp Starting test case [testTldListener]
21-Nov-2017 15:39:33.398 INFO [main] org.apache.coyote.AbstractProtocol.init Initializing ProtocolHandler ["http-nio-127.0.0.1-auto-1"]
21-Nov-2017 15:39:33.408 INFO [main] org.apache.tomcat.util.net.NioSelectorPool.getSharedSelector Using a shared selector for servlet write/read
21-Nov-2017 15:39:33.421 INFO [main] org.apache.catalina.core.StandardService.startInternal Starting service [Tomcat]
21-Nov-2017 15:39:33.421 INFO [main] org.apache.catalina.core.StandardEngine.startInternal Starting Servlet Engine: Apache Tomcat/9.0.2-dev
21-Nov-2017 15:39:33.671 INFO [main] org.apache.jasper.servlet.TldScanner.scanJars At least one JAR was scanned for TLDs yet contained no TLDs. Enable debug logging for this logger for a complete list of JARs that were scanned but no TLDs were found in them. Skipping unneeded JARs during scanning can improve startup time and JSP compilation time.
21-Nov-2017 15:39:33.702 INFO [main] org.apache.coyote.AbstractProtocol.start Starting ProtocolHandler ["http-nio-127.0.0.1-auto-1-47533"]
21-Nov-2017 15:39:33.722 INFO [main] org.apache.coyote.AbstractProtocol.pause Pausing ProtocolHandler ["http-nio-127.0.0.1-auto-1-47533"]
21-Nov-2017 15:39:33.775 INFO [main] org.apache.catalina.core.StandardService.stopInternal Stopping service [Tomcat]
21-Nov-2017 15:39:33.777 INFO [main] org.apache.coyote.AbstractProtocol.stop Stopping ProtocolHandler ["http-nio-127.0.0.1-auto-1-47533"]
21-Nov-2017 15:39:33.779 INFO [main] org.apache.coyote.AbstractProtocol.destroy Destroying ProtocolHandler ["http-nio-127.0.0.1-auto-1-47533"]
21-Nov-2017 15:39:33.789 INFO [main] org.apache.catalina.startup.LoggingBaseTest.setUp Starting test case [testWebappListenerConfigureFail]
21-Nov-2017 15:39:33.791 INFO [main] org.apache.coyote.AbstractProtocol.init Initializing ProtocolHandler ["http-nio-127.0.0.1-auto-2"]
21-Nov-2017 15:39:33.791 INFO [main] org.apache.tomcat.util.net.NioSelectorPool.getSharedSelector Using a shared selector for servlet write/read
21-Nov-2017 15:39:33.792 INFO [main] org.apache.catalina.core.StandardService.startInternal Starting service [Tomcat]
21-Nov-2017 15:39:33.792 INFO [main] org.apache.catalina.core.StandardEngine.startInternal Starting Servlet Engine: Apache Tomcat/9.0.2-dev
21-Nov-2017 15:39:33.793 INFO [main] org.apache.coyote.AbstractProtocol.start Starting ProtocolHandler ["http-nio-127.0.0.1-auto-2-51075"]
21-Nov-2017 15:39:33.865 INFO [main] org.apache.catalina.startup.ContextConfig.getDefaultWebXmlFragment No global web.xml found
21-Nov-2017 15:39:35.132 INFO [main] org.apache.coyote.AbstractProtocol.pause Pausing ProtocolHandler ["http-nio-127.0.0.1-auto-2-51075"]
21-Nov-2017 15:39:35.132 INFO [main] org.apache.catalina.core.StandardService.stopInternal Stopping service [Tomcat]
21-Nov-2017 15:39:35.135 INFO [main] org.apache.coyote.AbstractProtocol.stop Stopping ProtocolHandler ["http-nio-127.0.0.1-auto-2-51075"]
21-Nov-2017 15:39:35.138 INFO [main] org.apache.coyote.AbstractProtocol.destroy Destroying ProtocolHandler ["http-nio-127.0.0.1-auto-2-51075"]
21-Nov-2017 15:39:35.140 INFO [main] org.apache.catalina.startup.LoggingBaseTest.setUp Starting test case [testDenyUncoveredHttpMethodsSCITrue]
21-Nov-2017 15:39:35.143 INFO [main] org.apache.coyote.AbstractProtocol.init Initializing ProtocolHandler ["http-nio-127.0.0.1-auto-3"]
21-Nov-2017 15:39:35.143 INFO [main] org.apache.tomcat.util.net.NioSelectorPool.getSharedSelector Using a shared selector for servlet write/read
21-Nov-2017 15:39:35.143 INFO [main] org.apache.catalina.core.StandardService.startInternal Starting service [Tomcat]
21-Nov-2017 15:39:35.144 INFO [main] org.apache.catalina.core.StandardEngine.startInternal Starting Servlet Engine: Apache Tomcat/9.0.2-dev
21-Nov-2017 15:39:35.151 INFO [main] org.apache.tomcat.util.descriptor.web.SecurityConstraint.findUncoveredHttpMethods Adding security constraints with URL pattern [/test] to deny access with the uncovered HTTP methods that are not one of the following [POST]
21-Nov-2017 15:39:35.152 INFO [main] org.apache.coyote.AbstractProtocol.start Starting ProtocolHandler ["http-nio-127.0.0.1-auto-3-38588"]
21-Nov-2017 15:39:35.169 INFO [main] org.apache.coyote.AbstractProtocol.pause Pausing ProtocolHandler ["http-nio-127.0.0.1-auto-3-38588"]
21-Nov-2017 15:39:35.219 INFO [main] org.apache.catalina.core.StandardService.stopInternal Stopping service [Tomcat]
21-Nov-2017 15:39:35.221 INFO [main] org.apache.coyote.AbstractProtocol.stop Stopping ProtocolHandler ["http-nio-127.0.0.1-auto-3-38588"]
21-Nov-2017 15:39:35.222 INFO [main] org.apache.coyote.AbstractProtocol.destroy Destroying ProtocolHandler ["http-nio-127.0.0.1-auto-3-38588"]
21-Nov-2017 15:39:35.224 INFO [main] org.apache.catalina.startup.LoggingBaseTest.setUp Starting test case [testAddPostConstructMethodNullClassName]
21-Nov-2017 15:39:35.226 INFO [main] org.apache.coyote.AbstractProtocol.destroy Destroying ProtocolHandler ["http-nio-127.0.0.1-auto-4"]
21-Nov-2017 15:39:35.227 INFO [main] org.apache.catalina.startup.LoggingBaseTest.setUp Starting test case [testAddPreDestroyMethodConflicts]
21-Nov-2017 15:39:35.228 INFO [main] org.apache.coyote.AbstractProtocol.destroy Destroying ProtocolHandler ["http-nio-127.0.0.1-auto-5"]
21-Nov-2017 15:39:35.229 INFO [main] org.apache.catalina.startup.LoggingBaseTest.setUp Starting test case [testBug46243]
21-Nov-2017 15:39:35.233 INFO [main] org.apache.coyote.AbstractProtocol.init Initializing ProtocolHandler ["http-nio-127.0.0.1-auto-6"]
21-Nov-2017 15:39:35.234 INFO [main] org.apache.tomcat.util.net.NioSelectorPool.getSharedSelector Using a shared selector for servlet write/read
21-Nov-2017 15:39:35.234 INFO [main] org.apache.catalina.core.StandardService.startInternal Starting service [Tomcat]
21-Nov-2017 15:39:35.235 INFO [main] org.apache.catalina.core.StandardEngine.startInternal Starting Servlet Engine: Apache Tomcat/9.0.2-dev
21-Nov-2017 15:39:35.240 SEVERE [main] org.apache.catalina.core.StandardContext.filterStart Exception starting filter [Bug46243]
 javax.servlet.ServletException: Init fail (test)
	at org.apache.catalina.core.TestStandardContext$Bug46243Filter.init(TestStandardContext.java:173)
	at javax.servlet.GenericFilter.init(GenericFilter.java:61)
	at org.apache.catalina.core.ApplicationFilterConfig.initFilter(ApplicationFilterConfig.java:277)
	at org.apache.catalina.core.ApplicationFilterConfig.getFilter(ApplicationFilterConfig.java:258)
	at org.apache.catalina.core.ApplicationFilterConfig.<init>(ApplicationFilterConfig.java:104)
	at org.apache.catalina.core.StandardContext.filterStart(StandardContext.java:4491)
	at org.apache.catalina.core.StandardContext.startInternal(StandardContext.java:5131)
	at org.apache.catalina.util.LifecycleBase.start(LifecycleBase.java:183)
	at org.apache.catalina.core.ContainerBase$StartChild.call(ContainerBase.java:1425)
	at org.apache.catalina.core.ContainerBase$StartChild.call(ContainerBase.java:1415)
	at java.util.concurrent.FutureTask.run(FutureTask.java:266)
	at org.apache.tomcat.util.threads.InlineExecutorService.execute(InlineExecutorService.java:75)
	at java.util.concurrent.AbstractExecutorService.submit(AbstractExecutorService.java:134)
	at org.apache.catalina.core.ContainerBase.startInternal(ContainerBase.java:941)
	at org.apache.catalina.core.StandardHost.startInternal(StandardHost.java:839)
	at org.apache.catalina.util.LifecycleBase.start(LifecycleBase.java:183)
	at org.apache.catalina.core.ContainerBase$StartChild.call(ContainerBase.java:1425)
	at org.apache.catalina.core.ContainerBase$StartChild.call(ContainerBase.java:1415)
	at java.util.concurrent.FutureTask.run(FutureTask.java:266)
	at org.apache.tomcat.util.threads.InlineExecutorService.execute(InlineExecutorService.java:75)
	at java.util.concurrent.AbstractExecutorService.submit(AbstractExecutorService.java:134)
	at org.apache.catalina.core.ContainerBase.startInternal(ContainerBase.java:941)
	at org.apache.catalina.core.StandardEngine.startInternal(StandardEngine.java:258)
	at org.apache.catalina.util.LifecycleBase.start(LifecycleBase.java:183)
	at org.apache.catalina.core.StandardService.startInternal(StandardService.java:422)
	at org.apache.catalina.util.LifecycleBase.start(LifecycleBase.java:183)
	at org.apache.catalina.core.StandardServer.startInternal(StandardServer.java:770)
	at org.apache.catalina.util.LifecycleBase.start(LifecycleBase.java:183)
	at org.apache.catalina.startup.Tomcat.start(Tomcat.java:371)
	at org.apache.catalina.startup.TomcatBaseTest$TomcatWithFastSessionIDs.start(TomcatBaseTest.java:826)
	at org.apache.catalina.core.TestStandardContext.testBug46243(TestStandardContext.java:97)
	at sun.reflect.NativeMethodAccessorImpl.invoke0(Native Method)
	at sun.reflect.NativeMethodAccessorImpl.invoke(NativeMethodAccessorImpl.java:62)
	at sun.reflect.DelegatingMethodAccessorImpl.invoke(DelegatingMethodAccessorImpl.java:43)
	at java.lang.reflect.Method.invoke(Method.java:498)
	at org.junit.runners.model.FrameworkMethod$1.runReflectiveCall(FrameworkMethod.java:59)
	at org.junit.internal.runners.model.ReflectiveCallable.run(ReflectiveCallable.java:12)
	at org.junit.runners.model.FrameworkMethod.invokeExplosively(FrameworkMethod.java:61)
	at org.junit.internal.runners.statements.InvokeMethod.evaluate(InvokeMethod.java:17)
	at org.junit.internal.runners.statements.RunBefores.evaluate(RunBefores.java:26)
	at org.junit.internal.runners.statements.RunAfters.evaluate(RunAfters.java:27)
	at org.junit.rules.TestWatcher$1.evaluate(TestWatcher.java:55)
	at org.junit.runners.BlockJUnit4ClassRunner$1.evaluate(BlockJUnit4ClassRunner.java:100)
	at org.junit.runners.ParentRunner.runLeaf(ParentRunner.java:346)
	at org.junit.runners.BlockJUnit4ClassRunner.runChild(BlockJUnit4ClassRunner.java:103)
	at org.junit.runners.BlockJUnit4ClassRunner.runChild(BlockJUnit4ClassRunner.java:63)
	at org.junit.runners.ParentRunner$3.run(ParentRunner.java:311)
	at org.junit.runners.ParentRunner$1.schedule(ParentRunner.java:76)
	at org.junit.runners.ParentRunner.runChildren(ParentRunner.java:309)
	at org.junit.runners.ParentRunner.access$100(ParentRunner.java:63)
	at org.junit.runners.ParentRunner$2.evaluate(ParentRunner.java:289)
	at org.junit.internal.runners.statements.RunBefores.evaluate(RunBefores.java:26)
	at org.junit.internal.runners.statements.RunAfters.evaluate(RunAfters.java:27)
	at org.junit.runners.ParentRunner.run(ParentRunner.java:393)
	at junit.framework.JUnit4TestAdapter.run(JUnit4TestAdapter.java:48)
	at org.apache.tools.ant.taskdefs.optional.junit.JUnitTestRunner.run(JUnitTestRunner.java:539)
	at org.apache.tools.ant.taskdefs.optional.junit.JUnitTestRunner.launch(JUnitTestRunner.java:1210)
	at org.apache.tools.ant.taskdefs.optional.junit.JUnitTestRunner.main(JUnitTestRunner.java:1052)
Caused by: java.lang.ClassNotFoundException
	... 58 more

21-Nov-2017 15:39:35.242 SEVERE [main] org.apache.catalina.core.StandardContext.startInternal One or more Filters failed to start. Full details will be found in the appropriate container log file
21-Nov-2017 15:39:35.242 SEVERE [main] org.apache.catalina.core.StandardContext.startInternal Context [] startup failed due to previous errors
21-Nov-2017 15:39:35.247 INFO [main] org.apache.coyote.AbstractProtocol.start Starting ProtocolHandler ["http-nio-127.0.0.1-auto-6-40513"]
21-Nov-2017 15:39:35.257 INFO [main] org.apache.coyote.AbstractProtocol.pause Pausing ProtocolHandler ["http-nio-127.0.0.1-auto-6-40513"]
21-Nov-2017 15:39:35.307 INFO [main] org.apache.catalina.core.StandardService.stopInternal Stopping service [Tomcat]
21-Nov-2017 15:39:35.309 INFO [main] org.apache.coyote.AbstractProtocol.stop Stopping ProtocolHandler ["http-nio-127.0.0.1-auto-6-40513"]
21-Nov-2017 15:39:35.310 INFO [main] org.apache.coyote.AbstractProtocol.destroy Destroying ProtocolHandler ["http-nio-127.0.0.1-auto-6-40513"]
21-Nov-2017 15:39:35.312 INFO [main] org.apache.catalina.startup.LoggingBaseTest.setUp Starting test case [testBug49711]
21-Nov-2017 15:39:35.316 INFO [main] org.apache.coyote.AbstractProtocol.init Initializing ProtocolHandler ["http-nio-127.0.0.1-auto-7"]
21-Nov-2017 15:39:35.316 INFO [main] org.apache.tomcat.util.net.NioSelectorPool.getSharedSelector Using a shared selector for servlet write/read
21-Nov-2017 15:39:35.316 INFO [main] org.apache.catalina.core.StandardService.startInternal Starting service [Tomcat]
21-Nov-2017 15:39:35.317 INFO [main] org.apache.catalina.core.StandardEngine.startInternal Starting Servlet Engine: Apache Tomcat/9.0.2-dev
21-Nov-2017 15:39:35.321 INFO [main] org.apache.coyote.AbstractProtocol.start Starting ProtocolHandler ["http-nio-127.0.0.1-auto-7-37521"]
21-Nov-2017 15:39:35.325 SEVERE [http-nio-127.0.0.1-auto-7-exec-1] org.apache.catalina.core.StandardWrapperValve.invoke Servlet.service() for servlet [regular] in context with path [] threw exception
 java.lang.IllegalStateException: Unable to process parts as no multi-part configuration has been provided
	at org.apache.catalina.connector.Request.parseParts(Request.java:2751)
	at org.apache.catalina.connector.Request.getParts(Request.java:2717)
	at org.apache.catalina.connector.RequestFacade.getParts(RequestFacade.java:1098)
	at org.apache.catalina.core.TestStandardContext$Bug49711Servlet.service(TestStandardContext.java:701)
	at javax.servlet.http.HttpServlet.service(HttpServlet.java:741)
	at org.apache.catalina.core.ApplicationFilterChain.internalDoFilter(ApplicationFilterChain.java:231)
	at org.apache.catalina.core.ApplicationFilterChain.doFilter(ApplicationFilterChain.java:166)
	at org.apache.catalina.core.StandardWrapperValve.invoke(StandardWrapperValve.java:199)
	at org.apache.catalina.core.StandardContextValve.invoke(StandardContextValve.java:96)
	at org.apache.catalina.authenticator.AuthenticatorBase.invoke(AuthenticatorBase.java:475)
	at org.apache.catalina.core.StandardHostValve.invoke(StandardHostValve.java:140)
	at org.apache.catalina.valves.ErrorReportValve.invoke(ErrorReportValve.java:81)
	at org.apache.catalina.valves.AbstractAccessLogValve.invoke(AbstractAccessLogValve.java:651)
	at org.apache.catalina.core.StandardEngineValve.invoke(StandardEngineValve.java:87)
	at org.apache.catalina.connector.CoyoteAdapter.service(CoyoteAdapter.java:342)
	at org.apache.coyote.http11.Http11Processor.service(Http11Processor.java:501)
	at org.apache.coyote.AbstractProcessorLight.process(AbstractProcessorLight.java:66)
	at org.apache.coyote.AbstractProtocol$ConnectionHandler.process(AbstractProtocol.java:754)
	at org.apache.tomcat.util.net.NioEndpoint$SocketProcessor.doRun(NioEndpoint.java:1376)
	at org.apache.tomcat.util.net.SocketProcessorBase.run(SocketProcessorBase.java:49)
	at java.util.concurrent.ThreadPoolExecutor.runWorker(ThreadPoolExecutor.java:1149)
	at java.util.concurrent.ThreadPoolExecutor$Worker.run(ThreadPoolExecutor.java:624)
	at org.apache.tomcat.util.threads.TaskThread$WrappingRunnable.run(TaskThread.java:61)
	at java.lang.Thread.run(Thread.java:748)

21-Nov-2017 15:39:35.348 SEVERE [http-nio-127.0.0.1-auto-7-exec-3] org.apache.catalina.core.StandardWrapperValve.invoke Servlet.service() for servlet [regular] in context with path [] threw exception
 java.lang.IllegalStateException: Unable to process parts as no multi-part configuration has been provided
	at org.apache.catalina.connector.Request.parseParts(Request.java:2751)
	at org.apache.catalina.connector.Request.getParts(Request.java:2717)
	at org.apache.catalina.connector.RequestFacade.getParts(RequestFacade.java:1098)
	at org.apache.catalina.core.TestStandardContext$Bug49711Servlet.service(TestStandardContext.java:701)
	at javax.servlet.http.HttpServlet.service(HttpServlet.java:741)
	at org.apache.catalina.core.ApplicationFilterChain.internalDoFilter(ApplicationFilterChain.java:231)
	at org.apache.catalina.core.ApplicationFilterChain.doFilter(ApplicationFilterChain.java:166)
	at org.apache.catalina.core.StandardWrapperValve.invoke(StandardWrapperValve.java:199)
	at org.apache.catalina.core.StandardContextValve.invoke(StandardContextValve.java:96)
	at org.apache.catalina.authenticator.AuthenticatorBase.invoke(AuthenticatorBase.java:475)
	at org.apache.catalina.core.StandardHostValve.invoke(StandardHostValve.java:140)
	at org.apache.catalina.valves.ErrorReportValve.invoke(ErrorReportValve.java:81)
	at org.apache.catalina.valves.AbstractAccessLogValve.invoke(AbstractAccessLogValve.java:651)
	at org.apache.catalina.core.StandardEngineValve.invoke(StandardEngineValve.java:87)
	at org.apache.catalina.connector.CoyoteAdapter.service(CoyoteAdapter.java:342)
	at org.apache.coyote.http11.Http11Processor.service(Http11Processor.java:501)
	at org.apache.coyote.AbstractProcessorLight.process(AbstractProcessorLight.java:66)
	at org.apache.coyote.AbstractProtocol$ConnectionHandler.process(AbstractProtocol.java:754)
	at org.apache.tomcat.util.net.NioEndpoint$SocketProcessor.doRun(NioEndpoint.java:1376)
	at org.apache.tomcat.util.net.SocketProcessorBase.run(SocketProcessorBase.java:49)
	at java.util.concurrent.ThreadPoolExecutor.runWorker(ThreadPoolExecutor.java:1149)
	at java.util.concurrent.ThreadPoolExecutor$Worker.run(ThreadPoolExecutor.java:624)
	at org.apache.tomcat.util.threads.TaskThread$WrappingRunnable.run(TaskThread.java:61)
	at java.lang.Thread.run(Thread.java:748)

21-Nov-2017 15:39:35.352 INFO [main] org.apache.coyote.AbstractProtocol.pause Pausing ProtocolHandler ["http-nio-127.0.0.1-auto-7-37521"]
21-Nov-2017 15:39:35.403 INFO [main] org.apache.catalina.core.StandardService.stopInternal Stopping service [Tomcat]
21-Nov-2017 15:39:35.404 INFO [main] org.apache.coyote.AbstractProtocol.stop Stopping ProtocolHandler ["http-nio-127.0.0.1-auto-7-37521"]
21-Nov-2017 15:39:35.405 INFO [main] org.apache.coyote.AbstractProtocol.destroy Destroying ProtocolHandler ["http-nio-127.0.0.1-auto-7-37521"]
21-Nov-2017 15:39:35.407 INFO [main] org.apache.catalina.startup.LoggingBaseTest.setUp Starting test case [testBug49922]
21-Nov-2017 15:39:35.408 INFO [main] org.apache.coyote.AbstractProtocol.init Initializing ProtocolHandler ["http-nio-127.0.0.1-auto-8"]
21-Nov-2017 15:39:35.409 INFO [main] org.apache.tomcat.util.net.NioSelectorPool.getSharedSelector Using a shared selector for servlet write/read
21-Nov-2017 15:39:35.409 INFO [main] org.apache.catalina.core.StandardService.startInternal Starting service [Tomcat]
21-Nov-2017 15:39:35.409 INFO [main] org.apache.catalina.core.StandardEngine.startInternal Starting Servlet Engine: Apache Tomcat/9.0.2-dev
21-Nov-2017 15:39:35.414 INFO [main] org.apache.catalina.startup.ContextConfig.getDefaultWebXmlFragment No global web.xml found
21-Nov-2017 15:39:35.557 INFO [main] org.apache.coyote.AbstractProtocol.start Starting ProtocolHandler ["http-nio-127.0.0.1-auto-8-48730"]
21-Nov-2017 15:39:35.589 INFO [main] org.apache.coyote.AbstractProtocol.pause Pausing ProtocolHandler ["http-nio-127.0.0.1-auto-8-48730"]
21-Nov-2017 15:39:35.640 INFO [main] org.apache.catalina.core.StandardService.stopInternal Stopping service [Tomcat]
21-Nov-2017 15:39:35.644 INFO [main] org.apache.coyote.AbstractProtocol.stop Stopping ProtocolHandler ["http-nio-127.0.0.1-auto-8-48730"]
21-Nov-2017 15:39:35.648 INFO [main] org.apache.coyote.AbstractProtocol.destroy Destroying ProtocolHandler ["http-nio-127.0.0.1-auto-8-48730"]
21-Nov-2017 15:39:35.652 INFO [main] org.apache.catalina.startup.LoggingBaseTest.setUp Starting test case [testBug50015]
21-Nov-2017 15:39:35.654 INFO [main] org.apache.coyote.AbstractProtocol.init Initializing ProtocolHandler ["http-nio-127.0.0.1-auto-9"]
21-Nov-2017 15:39:35.654 INFO [main] org.apache.tomcat.util.net.NioSelectorPool.getSharedSelector Using a shared selector for servlet write/read

Continuation...

21-Nov-2017 15:39:35.655 INFO [main] org.apache.catalina.core.StandardService.startInternal Starting service [Tomcat]
21-Nov-2017 15:39:35.655 INFO [main] org.apache.catalina.core.StandardEngine.startInternal Starting Servlet Engine: Apache Tomcat/9.0.2-dev
21-Nov-2017 15:39:35.661 INFO [main] org.apache.coyote.AbstractProtocol.start Starting ProtocolHandler ["http-nio-127.0.0.1-auto-9-35747"]
21-Nov-2017 15:39:35.670 INFO [main] org.apache.coyote.AbstractProtocol.pause Pausing ProtocolHandler ["http-nio-127.0.0.1-auto-9-35747"]
21-Nov-2017 15:39:35.721 INFO [main] org.apache.catalina.core.StandardService.stopInternal Stopping service [Tomcat]
21-Nov-2017 15:39:35.723 INFO [main] org.apache.coyote.AbstractProtocol.stop Stopping ProtocolHandler ["http-nio-127.0.0.1-auto-9-35747"]
21-Nov-2017 15:39:35.726 INFO [main] org.apache.coyote.AbstractProtocol.destroy Destroying ProtocolHandler ["http-nio-127.0.0.1-auto-9-35747"]
21-Nov-2017 15:39:35.728 INFO [main] org.apache.catalina.startup.LoggingBaseTest.setUp Starting test case [testBug56085]
21-Nov-2017 15:39:35.729 INFO [main] org.apache.coyote.AbstractProtocol.init Initializing ProtocolHandler ["http-nio-127.0.0.1-auto-10"]
21-Nov-2017 15:39:35.730 INFO [main] org.apache.tomcat.util.net.NioSelectorPool.getSharedSelector Using a shared selector for servlet write/read
21-Nov-2017 15:39:35.730 INFO [main] org.apache.catalina.core.StandardService.startInternal Starting service [Tomcat]
21-Nov-2017 15:39:35.730 INFO [main] org.apache.catalina.core.StandardEngine.startInternal Starting Servlet Engine: Apache Tomcat/9.0.2-dev
21-Nov-2017 15:39:35.737 INFO [main] org.apache.catalina.startup.ContextConfig.getDefaultWebXmlFragment No global web.xml found
21-Nov-2017 15:39:35.918 INFO [main] org.apache.coyote.AbstractProtocol.start Starting ProtocolHandler ["http-nio-127.0.0.1-auto-10-57161"]
21-Nov-2017 15:39:35.923 INFO [main] org.apache.coyote.AbstractProtocol.pause Pausing ProtocolHandler ["http-nio-127.0.0.1-auto-10-57161"]
21-Nov-2017 15:39:35.974 INFO [main] org.apache.catalina.core.StandardService.stopInternal Stopping service [Tomcat]
21-Nov-2017 15:39:35.977 INFO [main] org.apache.coyote.AbstractProtocol.stop Stopping ProtocolHandler ["http-nio-127.0.0.1-auto-10-57161"]
21-Nov-2017 15:39:35.983 INFO [main] org.apache.coyote.AbstractProtocol.destroy Destroying ProtocolHandler ["http-nio-127.0.0.1-auto-10-57161"]
21-Nov-2017 15:39:35.985 INFO [main] org.apache.catalina.startup.LoggingBaseTest.setUp Starting test case [testBug56903]
21-Nov-2017 15:39:35.994 INFO [main] org.apache.coyote.AbstractProtocol.destroy Destroying ProtocolHandler ["http-nio-127.0.0.1-auto-11"]
21-Nov-2017 15:39:35.995 INFO [main] org.apache.catalina.startup.LoggingBaseTest.setUp Starting test case [testWebappLoaderStartFail]
21-Nov-2017 15:39:35.997 INFO [main] org.apache.coyote.AbstractProtocol.init Initializing ProtocolHandler ["http-nio-127.0.0.1-auto-12"]
21-Nov-2017 15:39:35.998 INFO [main] org.apache.tomcat.util.net.NioSelectorPool.getSharedSelector Using a shared selector for servlet write/read
21-Nov-2017 15:39:35.999 INFO [main] org.apache.catalina.core.StandardService.startInternal Starting service [Tomcat]
21-Nov-2017 15:39:36.000 INFO [main] org.apache.catalina.core.StandardEngine.startInternal Starting Servlet Engine: Apache Tomcat/9.0.2-dev
21-Nov-2017 15:39:36.001 INFO [main] org.apache.coyote.AbstractProtocol.start Starting ProtocolHandler ["http-nio-127.0.0.1-auto-12-48072"]
21-Nov-2017 15:39:36.020 INFO [main] org.apache.catalina.startup.ContextConfig.getDefaultWebXmlFragment No global web.xml found
21-Nov-2017 15:39:36.217 INFO [main] org.apache.coyote.AbstractProtocol.pause Pausing ProtocolHandler ["http-nio-127.0.0.1-auto-12-48072"]
21-Nov-2017 15:39:36.217 INFO [main] org.apache.catalina.core.StandardService.stopInternal Stopping service [Tomcat]
21-Nov-2017 15:39:36.219 INFO [main] org.apache.coyote.AbstractProtocol.stop Stopping ProtocolHandler ["http-nio-127.0.0.1-auto-12-48072"]
21-Nov-2017 15:39:36.221 INFO [main] org.apache.coyote.AbstractProtocol.destroy Destroying ProtocolHandler ["http-nio-127.0.0.1-auto-12-48072"]
21-Nov-2017 15:39:36.223 INFO [main] org.apache.catalina.startup.LoggingBaseTest.setUp Starting test case [testBug51376a]
21-Nov-2017 15:39:36.224 INFO [main] org.apache.coyote.AbstractProtocol.init Initializing ProtocolHandler ["http-nio-127.0.0.1-auto-13"]
21-Nov-2017 15:39:36.224 INFO [main] org.apache.tomcat.util.net.NioSelectorPool.getSharedSelector Using a shared selector for servlet write/read
21-Nov-2017 15:39:36.228 INFO [main] org.apache.catalina.core.StandardService.startInternal Starting service [Tomcat]
21-Nov-2017 15:39:36.228 INFO [main] org.apache.catalina.core.StandardEngine.startInternal Starting Servlet Engine: Apache Tomcat/9.0.2-dev
21-Nov-2017 15:39:36.232 INFO [main] org.apache.coyote.AbstractProtocol.start Starting ProtocolHandler ["http-nio-127.0.0.1-auto-13-56367"]
21-Nov-2017 15:39:36.245 INFO [main] org.apache.coyote.AbstractProtocol.pause Pausing ProtocolHandler ["http-nio-127.0.0.1-auto-13-56367"]
21-Nov-2017 15:39:36.297 INFO [main] org.apache.catalina.core.StandardService.stopInternal Stopping service [Tomcat]
21-Nov-2017 15:39:36.298 INFO [main] org.apache.coyote.AbstractProtocol.stop Stopping ProtocolHandler ["http-nio-127.0.0.1-auto-13-56367"]
21-Nov-2017 15:39:36.299 INFO [main] org.apache.coyote.AbstractProtocol.destroy Destroying ProtocolHandler ["http-nio-127.0.0.1-auto-13-56367"]
21-Nov-2017 15:39:36.302 INFO [main] org.apache.catalina.startup.LoggingBaseTest.setUp Starting test case [testBug51376b]
21-Nov-2017 15:39:36.303 INFO [main] org.apache.coyote.AbstractProtocol.init Initializing ProtocolHandler ["http-nio-127.0.0.1-auto-14"]
21-Nov-2017 15:39:36.304 INFO [main] org.apache.tomcat.util.net.NioSelectorPool.getSharedSelector Using a shared selector for servlet write/read
21-Nov-2017 15:39:36.304 INFO [main] org.apache.catalina.core.StandardService.startInternal Starting service [Tomcat]
21-Nov-2017 15:39:36.304 INFO [main] org.apache.catalina.core.StandardEngine.startInternal Starting Servlet Engine: Apache Tomcat/9.0.2-dev
21-Nov-2017 15:39:36.310 INFO [main] org.apache.coyote.AbstractProtocol.start Starting ProtocolHandler ["http-nio-127.0.0.1-auto-14-48006"]
21-Nov-2017 15:39:36.317 INFO [main] org.apache.coyote.AbstractProtocol.pause Pausing ProtocolHandler ["http-nio-127.0.0.1-auto-14-48006"]
21-Nov-2017 15:39:36.368 INFO [main] org.apache.catalina.core.StandardService.stopInternal Stopping service [Tomcat]
21-Nov-2017 15:39:36.368 INFO [main] org.apache.coyote.AbstractProtocol.stop Stopping ProtocolHandler ["http-nio-127.0.0.1-auto-14-48006"]
21-Nov-2017 15:39:36.370 INFO [main] org.apache.coyote.AbstractProtocol.destroy Destroying ProtocolHandler ["http-nio-127.0.0.1-auto-14-48006"]
21-Nov-2017 15:39:36.372 INFO [main] org.apache.catalina.startup.LoggingBaseTest.setUp Starting test case [testBug57556a]
21-Nov-2017 15:39:36.374 INFO [main] org.apache.coyote.AbstractProtocol.init Initializing ProtocolHandler ["http-nio-127.0.0.1-auto-15"]
21-Nov-2017 15:39:36.375 INFO [main] org.apache.tomcat.util.net.NioSelectorPool.getSharedSelector Using a shared selector for servlet write/read
21-Nov-2017 15:39:36.375 INFO [main] org.apache.catalina.core.StandardService.startInternal Starting service [Tomcat]
21-Nov-2017 15:39:36.375 INFO [main] org.apache.catalina.core.StandardEngine.startInternal Starting Servlet Engine: Apache Tomcat/9.0.2-dev
21-Nov-2017 15:39:36.383 INFO [main] org.apache.catalina.startup.ContextConfig.getDefaultWebXmlFragment No global web.xml found
21-Nov-2017 15:39:36.474 INFO [main] org.apache.coyote.AbstractProtocol.start Starting ProtocolHandler ["http-nio-127.0.0.1-auto-15-41937"]
21-Nov-2017 15:39:36.492 INFO [main] org.apache.coyote.AbstractProtocol.pause Pausing ProtocolHandler ["http-nio-127.0.0.1-auto-15-41937"]
21-Nov-2017 15:39:36.492 INFO [main] org.apache.catalina.core.StandardService.stopInternal Stopping service [Tomcat]
21-Nov-2017 15:39:36.494 INFO [main] org.apache.coyote.AbstractProtocol.stop Stopping ProtocolHandler ["http-nio-127.0.0.1-auto-15-41937"]
21-Nov-2017 15:39:36.511 INFO [main] org.apache.coyote.AbstractProtocol.destroy Destroying ProtocolHandler ["http-nio-127.0.0.1-auto-15-41937"]
21-Nov-2017 15:39:36.513 INFO [main] org.apache.catalina.startup.LoggingBaseTest.setUp Starting test case [testBug57556b]
21-Nov-2017 15:39:36.515 INFO [main] org.apache.coyote.AbstractProtocol.init Initializing ProtocolHandler ["http-nio-127.0.0.1-auto-16"]
21-Nov-2017 15:39:36.516 INFO [main] org.apache.tomcat.util.net.NioSelectorPool.getSharedSelector Using a shared selector for servlet write/read
21-Nov-2017 15:39:36.516 INFO [main] org.apache.catalina.core.StandardService.startInternal Starting service [Tomcat]
21-Nov-2017 15:39:36.516 INFO [main] org.apache.catalina.core.StandardEngine.startInternal Starting Servlet Engine: Apache Tomcat/9.0.2-dev
21-Nov-2017 15:39:36.521 INFO [main] org.apache.coyote.AbstractProtocol.start Starting ProtocolHandler ["http-nio-127.0.0.1-auto-16-42149"]
21-Nov-2017 15:39:36.529 INFO [main] org.apache.coyote.AbstractProtocol.pause Pausing ProtocolHandler ["http-nio-127.0.0.1-auto-16-42149"]
21-Nov-2017 15:39:36.580 INFO [main] org.apache.catalina.core.StandardService.stopInternal Stopping service [Tomcat]
21-Nov-2017 15:39:36.582 INFO [main] org.apache.coyote.AbstractProtocol.stop Stopping ProtocolHandler ["http-nio-127.0.0.1-auto-16-42149"]
21-Nov-2017 15:39:36.584 INFO [main] org.apache.coyote.AbstractProtocol.destroy Destroying ProtocolHandler ["http-nio-127.0.0.1-auto-16-42149"]
21-Nov-2017 15:39:36.586 INFO [main] org.apache.catalina.startup.LoggingBaseTest.setUp Starting test case [testFlagFailCtxIfServletStartFails]
21-Nov-2017 15:39:36.588 INFO [main] org.apache.coyote.AbstractProtocol.init Initializing ProtocolHandler ["http-nio-127.0.0.1-auto-17"]
21-Nov-2017 15:39:36.588 INFO [main] org.apache.tomcat.util.net.NioSelectorPool.getSharedSelector Using a shared selector for servlet write/read
21-Nov-2017 15:39:36.588 INFO [main] org.apache.catalina.core.StandardService.startInternal Starting service [Tomcat]
21-Nov-2017 15:39:36.588 INFO [main] org.apache.catalina.core.StandardEngine.startInternal Starting Servlet Engine: Apache Tomcat/9.0.2-dev
21-Nov-2017 15:39:36.594 SEVERE [main] org.apache.catalina.core.StandardContext.loadOnStartup Servlet [myservlet] in web application [] threw load() exception
 javax.servlet.ServletException: failing on purpose
	at org.apache.catalina.core.TestStandardContext$FailingStartupServlet.init(TestStandardContext.java:905)
	at javax.servlet.GenericServlet.init(GenericServlet.java:158)
	at org.apache.catalina.startup.Tomcat$ExistingStandardWrapper.loadServlet(Tomcat.java:1037)
	at org.apache.catalina.core.StandardWrapper.load(StandardWrapper.java:980)
	at org.apache.catalina.core.StandardContext.loadOnStartup(StandardContext.java:4829)
	at org.apache.catalina.core.StandardContext.startInternal(StandardContext.java:5139)
	at org.apache.catalina.util.LifecycleBase.start(LifecycleBase.java:183)
	at org.apache.catalina.core.ContainerBase$StartChild.call(ContainerBase.java:1425)
	at org.apache.catalina.core.ContainerBase$StartChild.call(ContainerBase.java:1415)
	at java.util.concurrent.FutureTask.run(FutureTask.java:266)
	at org.apache.tomcat.util.threads.InlineExecutorService.execute(InlineExecutorService.java:75)
	at java.util.concurrent.AbstractExecutorService.submit(AbstractExecutorService.java:134)
	at org.apache.catalina.core.ContainerBase.startInternal(ContainerBase.java:941)
	at org.apache.catalina.core.StandardHost.startInternal(StandardHost.java:839)
	at org.apache.catalina.util.LifecycleBase.start(LifecycleBase.java:183)
	at org.apache.catalina.core.ContainerBase$StartChild.call(ContainerBase.java:1425)
	at org.apache.catalina.core.ContainerBase$StartChild.call(ContainerBase.java:1415)
	at java.util.concurrent.FutureTask.run(FutureTask.java:266)
	at org.apache.tomcat.util.threads.InlineExecutorService.execute(InlineExecutorService.java:75)
	at java.util.concurrent.AbstractExecutorService.submit(AbstractExecutorService.java:134)
	at org.apache.catalina.core.ContainerBase.startInternal(ContainerBase.java:941)
	at org.apache.catalina.core.StandardEngine.startInternal(StandardEngine.java:258)
	at org.apache.catalina.util.LifecycleBase.start(LifecycleBase.java:183)
	at org.apache.catalina.core.StandardService.startInternal(StandardService.java:422)
	at org.apache.catalina.util.LifecycleBase.start(LifecycleBase.java:183)
	at org.apache.catalina.core.StandardServer.startInternal(StandardServer.java:770)
	at org.apache.catalina.util.LifecycleBase.start(LifecycleBase.java:183)
	at org.apache.catalina.startup.Tomcat.start(Tomcat.java:371)
	at org.apache.catalina.startup.TomcatBaseTest$TomcatWithFastSessionIDs.start(TomcatBaseTest.java:826)
	at org.apache.catalina.core.TestStandardContext.testFlagFailCtxIfServletStartFails(TestStandardContext.java:881)
	at sun.reflect.NativeMethodAccessorImpl.invoke0(Native Method)
	at sun.reflect.NativeMethodAccessorImpl.invoke(NativeMethodAccessorImpl.java:62)
	at sun.reflect.DelegatingMethodAccessorImpl.invoke(DelegatingMethodAccessorImpl.java:43)
	at java.lang.reflect.Method.invoke(Method.java:498)
	at org.junit.runners.model.FrameworkMethod$1.runReflectiveCall(FrameworkMethod.java:59)
	at org.junit.internal.runners.model.ReflectiveCallable.run(ReflectiveCallable.java:12)
	at org.junit.runners.model.FrameworkMethod.invokeExplosively(FrameworkMethod.java:61)
	at org.junit.internal.runners.statements.InvokeMethod.evaluate(InvokeMethod.java:17)
	at org.junit.internal.runners.statements.RunBefores.evaluate(RunBefores.java:26)
	at org.junit.internal.runners.statements.RunAfters.evaluate(RunAfters.java:27)
	at org.junit.rules.TestWatcher$1.evaluate(TestWatcher.java:55)
	at org.junit.runners.BlockJUnit4ClassRunner$1.evaluate(BlockJUnit4ClassRunner.java:100)
	at org.junit.runners.ParentRunner.runLeaf(ParentRunner.java:346)
	at org.junit.runners.BlockJUnit4ClassRunner.runChild(BlockJUnit4ClassRunner.java:103)
	at org.junit.runners.BlockJUnit4ClassRunner.runChild(BlockJUnit4ClassRunner.java:63)
	at org.junit.runners.ParentRunner$3.run(ParentRunner.java:311)
	at org.junit.runners.ParentRunner$1.schedule(ParentRunner.java:76)
	at org.junit.runners.ParentRunner.runChildren(ParentRunner.java:309)
	at org.junit.runners.ParentRunner.access$100(ParentRunner.java:63)
	at org.junit.runners.ParentRunner$2.evaluate(ParentRunner.java:289)
	at org.junit.internal.runners.statements.RunBefores.evaluate(RunBefores.java:26)
	at org.junit.internal.runners.statements.RunAfters.evaluate(RunAfters.java:27)
	at org.junit.runners.ParentRunner.run(ParentRunner.java:393)
	at junit.framework.JUnit4TestAdapter.run(JUnit4TestAdapter.java:48)
	at org.apache.tools.ant.taskdefs.optional.junit.JUnitTestRunner.run(JUnitTestRunner.java:539)
	at org.apache.tools.ant.taskdefs.optional.junit.JUnitTestRunner.launch(JUnitTestRunner.java:1210)
	at org.apache.tools.ant.taskdefs.optional.junit.JUnitTestRunner.main(JUnitTestRunner.java:1052)

21-Nov-2017 15:39:36.596 INFO [main] org.apache.coyote.AbstractProtocol.start Starting ProtocolHandler ["http-nio-127.0.0.1-auto-17-48890"]
21-Nov-2017 15:39:36.604 INFO [main] org.apache.coyote.AbstractProtocol.pause Pausing ProtocolHandler ["http-nio-127.0.0.1-auto-17-48890"]
21-Nov-2017 15:39:36.604 INFO [main] org.apache.catalina.core.StandardService.stopInternal Stopping service [Tomcat]
21-Nov-2017 15:39:36.605 INFO [main] org.apache.coyote.AbstractProtocol.stop Stopping ProtocolHandler ["http-nio-127.0.0.1-auto-17-48890"]
21-Nov-2017 15:39:36.619 INFO [main] org.apache.catalina.core.StandardService.startInternal Starting service [Tomcat]
21-Nov-2017 15:39:36.620 INFO [main] org.apache.catalina.core.StandardEngine.startInternal Starting Servlet Engine: Apache Tomcat/9.0.2-dev
21-Nov-2017 15:39:36.623 SEVERE [main] org.apache.catalina.core.StandardContext.loadOnStartup Servlet [myservlet] in web application [] threw load() exception
 javax.servlet.ServletException: failing on purpose
	at org.apache.catalina.core.TestStandardContext$FailingStartupServlet.init(TestStandardContext.java:905)
	at javax.servlet.GenericServlet.init(GenericServlet.java:158)
	at org.apache.catalina.startup.Tomcat$ExistingStandardWrapper.loadServlet(Tomcat.java:1037)
	at org.apache.catalina.core.StandardWrapper.load(StandardWrapper.java:980)
	at org.apache.catalina.core.StandardContext.loadOnStartup(StandardContext.java:4829)
	at org.apache.catalina.core.StandardContext.startInternal(StandardContext.java:5139)
	at org.apache.catalina.util.LifecycleBase.start(LifecycleBase.java:183)
	at org.apache.catalina.core.ContainerBase$StartChild.call(ContainerBase.java:1425)
	at org.apache.catalina.core.ContainerBase$StartChild.call(ContainerBase.java:1415)
	at java.util.concurrent.FutureTask.run(FutureTask.java:266)
	at org.apache.tomcat.util.threads.InlineExecutorService.execute(InlineExecutorService.java:75)
	at java.util.concurrent.AbstractExecutorService.submit(AbstractExecutorService.java:134)
	at org.apache.catalina.core.ContainerBase.startInternal(ContainerBase.java:941)
	at org.apache.catalina.core.StandardHost.startInternal(StandardHost.java:839)
	at org.apache.catalina.util.LifecycleBase.start(LifecycleBase.java:183)
	at org.apache.catalina.core.ContainerBase$StartChild.call(ContainerBase.java:1425)
	at org.apache.catalina.core.ContainerBase$StartChild.call(ContainerBase.java:1415)
	at java.util.concurrent.FutureTask.run(FutureTask.java:266)
	at org.apache.tomcat.util.threads.InlineExecutorService.execute(InlineExecutorService.java:75)
	at java.util.concurrent.AbstractExecutorService.submit(AbstractExecutorService.java:134)
	at org.apache.catalina.core.ContainerBase.startInternal(ContainerBase.java:941)
	at org.apache.catalina.core.StandardEngine.startInternal(StandardEngine.java:258)
	at org.apache.catalina.util.LifecycleBase.start(LifecycleBase.java:183)
	at org.apache.catalina.core.StandardService.startInternal(StandardService.java:422)
	at org.apache.catalina.util.LifecycleBase.start(LifecycleBase.java:183)
	at org.apache.catalina.core.StandardServer.startInternal(StandardServer.java:770)
	at org.apache.catalina.util.LifecycleBase.start(LifecycleBase.java:183)
	at org.apache.catalina.startup.Tomcat.start(Tomcat.java:371)
	at org.apache.catalina.startup.TomcatBaseTest$TomcatWithFastSessionIDs.start(TomcatBaseTest.java:826)
	at org.apache.catalina.core.TestStandardContext.testFlagFailCtxIfServletStartFails(TestStandardContext.java:894)
	at sun.reflect.NativeMethodAccessorImpl.invoke0(Native Method)
	at sun.reflect.NativeMethodAccessorImpl.invoke(NativeMethodAccessorImpl.java:62)
	at sun.reflect.DelegatingMethodAccessorImpl.invoke(DelegatingMethodAccessorImpl.java:43)
	at java.lang.reflect.Method.invoke(Method.java:498)
	at org.junit.runners.model.FrameworkMethod$1.runReflectiveCall(FrameworkMethod.java:59)
	at org.junit.internal.runners.model.ReflectiveCallable.run(ReflectiveCallable.java:12)
	at org.junit.runners.model.FrameworkMethod.invokeExplosively(FrameworkMethod.java:61)
	at org.junit.internal.runners.statements.InvokeMethod.evaluate(InvokeMethod.java:17)
	at org.junit.internal.runners.statements.RunBefores.evaluate(RunBefores.java:26)
	at org.junit.internal.runners.statements.RunAfters.evaluate(RunAfters.java:27)
	at org.junit.rules.TestWatcher$1.evaluate(TestWatcher.java:55)
	at org.junit.runners.BlockJUnit4ClassRunner$1.evaluate(BlockJUnit4ClassRunner.java:100)
	at org.junit.runners.ParentRunner.runLeaf(ParentRunner.java:346)
	at org.junit.runners.BlockJUnit4ClassRunner.runChild(BlockJUnit4ClassRunner.java:103)
	at org.junit.runners.BlockJUnit4ClassRunner.runChild(BlockJUnit4ClassRunner.java:63)
	at org.junit.runners.ParentRunner$3.run(ParentRunner.java:311)
	at org.junit.runners.ParentRunner$1.schedule(ParentRunner.java:76)
	at org.junit.runners.ParentRunner.runChildren(ParentRunner.java:309)

Continuation...

	at org.junit.runners.ParentRunner.access$100(ParentRunner.java:63)
	at org.junit.runners.ParentRunner$2.evaluate(ParentRunner.java:289)
	at org.junit.internal.runners.statements.RunBefores.evaluate(RunBefores.java:26)
	at org.junit.internal.runners.statements.RunAfters.evaluate(RunAfters.java:27)
	at org.junit.runners.ParentRunner.run(ParentRunner.java:393)
	at junit.framework.JUnit4TestAdapter.run(JUnit4TestAdapter.java:48)
	at org.apache.tools.ant.taskdefs.optional.junit.JUnitTestRunner.run(JUnitTestRunner.java:539)
	at org.apache.tools.ant.taskdefs.optional.junit.JUnitTestRunner.launch(JUnitTestRunner.java:1210)
	at org.apache.tools.ant.taskdefs.optional.junit.JUnitTestRunner.main(JUnitTestRunner.java:1052)

21-Nov-2017 15:39:36.624 SEVERE [main] org.apache.catalina.core.StandardContext.startInternal One or more Servlets failed to load on startup. Full details will be found in the appropriate container log file
21-Nov-2017 15:39:36.624 SEVERE [main] org.apache.catalina.core.StandardContext.startInternal Context [] startup failed due to previous errors
21-Nov-2017 15:39:36.626 INFO [main] org.apache.coyote.AbstractProtocol.start Starting ProtocolHandler ["http-nio-127.0.0.1-auto-17-48890"]
21-Nov-2017 15:39:36.629 INFO [main] org.apache.coyote.AbstractProtocol.pause Pausing ProtocolHandler ["http-nio-127.0.0.1-auto-17-48890"]
21-Nov-2017 15:39:36.680 INFO [main] org.apache.catalina.core.StandardService.stopInternal Stopping service [Tomcat]
21-Nov-2017 15:39:36.680 INFO [main] org.apache.coyote.AbstractProtocol.stop Stopping ProtocolHandler ["http-nio-127.0.0.1-auto-17-48890"]
21-Nov-2017 15:39:36.681 INFO [main] org.apache.coyote.AbstractProtocol.destroy Destroying ProtocolHandler ["http-nio-127.0.0.1-auto-17-48890"]
21-Nov-2017 15:39:36.685 INFO [main] org.apache.catalina.startup.LoggingBaseTest.setUp Starting test case [testAddPreDestroyMethodNullClassName]
21-Nov-2017 15:39:36.686 INFO [main] org.apache.coyote.AbstractProtocol.destroy Destroying ProtocolHandler ["http-nio-127.0.0.1-auto-18"]
21-Nov-2017 15:39:36.687 INFO [main] org.apache.catalina.startup.LoggingBaseTest.setUp Starting test case [testAddPreDestroyMethodNullMethodName]
21-Nov-2017 15:39:36.691 INFO [main] org.apache.coyote.AbstractProtocol.destroy Destroying ProtocolHandler ["http-nio-127.0.0.1-auto-19"]
21-Nov-2017 15:39:36.692 INFO [main] org.apache.catalina.startup.LoggingBaseTest.setUp Starting test case [testAddPostConstructMethodNullMethodName]
21-Nov-2017 15:39:36.693 INFO [main] org.apache.coyote.AbstractProtocol.destroy Destroying ProtocolHandler ["http-nio-127.0.0.1-auto-20"]
21-Nov-2017 15:39:36.696 INFO [main] org.apache.catalina.startup.LoggingBaseTest.setUp Starting test case [testSetPath]
21-Nov-2017 15:39:36.698 WARNING [main] org.apache.catalina.core.StandardContext.setPath A context path must either be an empty string or start with a '/' and do not end with a '/'. The path [null] does not meet these criteria and has been changed to []
21-Nov-2017 15:39:36.698 WARNING [main] org.apache.catalina.core.StandardContext.setPath A context path must either be an empty string or start with a '/' and do not end with a '/'. The path [/] does not meet these criteria and has been changed to []
21-Nov-2017 15:39:36.698 WARNING [main] org.apache.catalina.core.StandardContext.setPath A context path must either be an empty string or start with a '/' and do not end with a '/'. The path [foo] does not meet these criteria and has been changed to [/foo]
21-Nov-2017 15:39:36.699 WARNING [main] org.apache.catalina.core.StandardContext.setPath A context path must either be an empty string or start with a '/' and do not end with a '/'. The path [/foo/bar/] does not meet these criteria and has been changed to [/foo/bar]
21-Nov-2017 15:39:36.699 WARNING [main] org.apache.catalina.core.StandardContext.setPath A context path must either be an empty string or start with a '/' and do not end with a '/'. The path [foo/bar/] does not meet these criteria and has been changed to [/foo/bar]
21-Nov-2017 15:39:36.700 INFO [main] org.apache.coyote.AbstractProtocol.destroy Destroying ProtocolHandler ["http-nio-127.0.0.1-auto-21"]
21-Nov-2017 15:39:36.700 INFO [main] org.apache.catalina.startup.LoggingBaseTest.setUp Starting test case [testAddPostConstructMethodConflicts]
21-Nov-2017 15:39:36.701 INFO [main] org.apache.coyote.AbstractProtocol.destroy Destroying ProtocolHandler ["http-nio-127.0.0.1-auto-22"]
21-Nov-2017 15:39:36.704 INFO [main] org.apache.catalina.startup.LoggingBaseTest.setUp Starting test case [testDenyUncoveredHttpMethodsSCIFalse]
21-Nov-2017 15:39:36.707 INFO [main] org.apache.coyote.AbstractProtocol.init Initializing ProtocolHandler ["http-nio-127.0.0.1-auto-23"]
21-Nov-2017 15:39:36.708 INFO [main] org.apache.tomcat.util.net.NioSelectorPool.getSharedSelector Using a shared selector for servlet write/read
21-Nov-2017 15:39:36.708 INFO [main] org.apache.catalina.core.StandardService.startInternal Starting service [Tomcat]
21-Nov-2017 15:39:36.708 INFO [main] org.apache.catalina.core.StandardEngine.startInternal Starting Servlet Engine: Apache Tomcat/9.0.2-dev
21-Nov-2017 15:39:36.711 SEVERE [main] org.apache.tomcat.util.descriptor.web.SecurityConstraint.findUncoveredHttpMethods For security constraints with URL pattern [/test] only the HTTP methods [POST] are covered. All other methods are uncovered.
21-Nov-2017 15:39:36.715 SEVERE [main] org.apache.tomcat.util.descriptor.web.SecurityConstraint.findUncoveredHttpMethods For security constraints with URL pattern [/test] only the HTTP methods [POST] are covered. All other methods are uncovered.
21-Nov-2017 15:39:36.718 INFO [main] org.apache.coyote.AbstractProtocol.start Starting ProtocolHandler ["http-nio-127.0.0.1-auto-23-39741"]
21-Nov-2017 15:39:36.732 INFO [main] org.apache.coyote.AbstractProtocol.pause Pausing ProtocolHandler ["http-nio-127.0.0.1-auto-23-39741"]
21-Nov-2017 15:39:36.783 INFO [main] org.apache.catalina.core.StandardService.stopInternal Stopping service [Tomcat]
21-Nov-2017 15:39:36.785 INFO [main] org.apache.coyote.AbstractProtocol.stop Stopping ProtocolHandler ["http-nio-127.0.0.1-auto-23-39741"]
21-Nov-2017 15:39:36.791 INFO [main] org.apache.coyote.AbstractProtocol.destroy Destroying ProtocolHandler ["http-nio-127.0.0.1-auto-23-39741"]
------------- ---------------- ---------------

Testcase: testTldListener took 0.93 sec
Testcase: testWebappListenerConfigureFail took 1.351 sec
Testcase: testDenyUncoveredHttpMethodsSCITrue took 0.083 sec
Testcase: testAddPostConstructMethodNullClassName took 0.003 sec
Testcase: testAddPreDestroyMethodConflicts took 0.002 sec
Testcase: testBug46243 took 0.082 sec
Testcase: testBug49711 took 0.094 sec
Testcase: testBug49922 took 0.245 sec
Testcase: testBug50015 took 0.075 sec
Testcase: testBug56085 took 0.257 sec
Testcase: testBug56903 took 0.011 sec
Testcase: testWebappLoaderStartFail took 0.227 sec
Testcase: testBug51376a took 0.079 sec
Testcase: testBug51376b took 0.07 sec
Testcase: testBug57556a took 0.14 sec
Testcase: testBug57556b took 0.073 sec
Testcase: testFlagFailCtxIfServletStartFails took 0.099 sec
Testcase: testAddPreDestroyMethodNullClassName took 0.002 sec
Testcase: testAddPreDestroyMethodNullMethodName took 0.004 sec
Testcase: testAddPostConstructMethodNullMethodName took 0.003 sec
Testcase: testSetPath took 0.005 sec
Testcase: testAddPostConstructMethodConflicts took 0.002 sec
Testcase: testDenyUncoveredHttpMethodsSCIFalse took 0.091 sec

Apache Gump, Gump, Apache, the Apache feather logo, and the Apache Gump project logos are trademarks of The Apache Software Foundation.

Last Updated: Tue, 21 Nov 2017 12:00:06 ().Python Logo