Run| Workspace| Log| Issues| Fixes| Pre-reqs| Stats| XRef| Maven Repository Proxy Log Gump Logo

Details

File Contents

Testsuite: org.apache.catalina.connector.TestConnector
Tests run: 12, Failures: 0, Errors: 0, Skipped: 0, Time elapsed: 2.248 sec
------------- Standard Error -----------------
25-Sep-2017 03:12:56.219 INFO [main] org.apache.catalina.startup.LoggingBaseTest.setUp Starting test case [testTraceAllowedCustom]
25-Sep-2017 03:12:56.518 INFO [main] org.apache.coyote.AbstractProtocol.init Initializing ProtocolHandler ["http-nio-127.0.0.1-auto-1"]
25-Sep-2017 03:12:56.527 INFO [main] org.apache.tomcat.util.net.NioSelectorPool.getSharedSelector Using a shared selector for servlet write/read
25-Sep-2017 03:12:56.532 INFO [main] org.apache.catalina.core.StandardService.startInternal Starting service [Tomcat]
25-Sep-2017 03:12:56.532 INFO [main] org.apache.catalina.core.StandardEngine.startInternal Starting Servlet Engine: Apache Tomcat/9.0.1-dev
25-Sep-2017 03:12:56.653 INFO [main] org.apache.coyote.AbstractProtocol.start Starting ProtocolHandler ["http-nio-127.0.0.1-auto-1-32819"]
25-Sep-2017 03:12:56.771 INFO [main] org.apache.coyote.AbstractProtocol.pause Pausing ProtocolHandler ["http-nio-127.0.0.1-auto-1-32819"]
25-Sep-2017 03:12:56.772 INFO [main] org.apache.catalina.core.StandardService.stopInternal Stopping service [Tomcat]
25-Sep-2017 03:12:56.782 INFO [main] org.apache.coyote.AbstractProtocol.stop Stopping ProtocolHandler ["http-nio-127.0.0.1-auto-1-32819"]
25-Sep-2017 03:12:56.785 INFO [main] org.apache.coyote.AbstractProtocol.destroy Destroying ProtocolHandler ["http-nio-127.0.0.1-auto-1-32819"]
25-Sep-2017 03:12:56.793 INFO [main] org.apache.catalina.startup.LoggingBaseTest.setUp Starting test case [testTraceAllowedWebDav]
25-Sep-2017 03:12:56.809 INFO [main] org.apache.coyote.AbstractProtocol.init Initializing ProtocolHandler ["http-nio-127.0.0.1-auto-2"]
25-Sep-2017 03:12:56.809 INFO [main] org.apache.tomcat.util.net.NioSelectorPool.getSharedSelector Using a shared selector for servlet write/read
25-Sep-2017 03:12:56.810 INFO [main] org.apache.catalina.core.StandardService.startInternal Starting service [Tomcat]
25-Sep-2017 03:12:56.810 INFO [main] org.apache.catalina.core.StandardEngine.startInternal Starting Servlet Engine: Apache Tomcat/9.0.1-dev
25-Sep-2017 03:12:56.816 INFO [main] org.apache.coyote.AbstractProtocol.start Starting ProtocolHandler ["http-nio-127.0.0.1-auto-2-38642"]
25-Sep-2017 03:12:56.822 INFO [main] org.apache.coyote.AbstractProtocol.pause Pausing ProtocolHandler ["http-nio-127.0.0.1-auto-2-38642"]
25-Sep-2017 03:12:56.872 INFO [main] org.apache.catalina.core.StandardService.stopInternal Stopping service [Tomcat]
25-Sep-2017 03:12:56.874 INFO [main] org.apache.coyote.AbstractProtocol.stop Stopping ProtocolHandler ["http-nio-127.0.0.1-auto-2-38642"]
25-Sep-2017 03:12:56.877 INFO [main] org.apache.coyote.AbstractProtocol.destroy Destroying ProtocolHandler ["http-nio-127.0.0.1-auto-2-38642"]
25-Sep-2017 03:12:56.878 INFO [main] org.apache.catalina.startup.LoggingBaseTest.setUp Starting test case [testDuplicatePortNoThrows]
25-Sep-2017 03:12:56.879 INFO [main] org.apache.coyote.AbstractProtocol.init Initializing ProtocolHandler ["http-nio-auto-3"]
25-Sep-2017 03:12:56.879 INFO [main] org.apache.tomcat.util.net.NioSelectorPool.getSharedSelector Using a shared selector for servlet write/read
25-Sep-2017 03:12:56.880 INFO [main] org.apache.coyote.AbstractProtocol.start Starting ProtocolHandler ["http-nio-auto-3-51529"]
25-Sep-2017 03:12:56.882 INFO [main] org.apache.coyote.AbstractProtocol.init Initializing ProtocolHandler ["http-nio-51529"]
25-Sep-2017 03:12:56.883 SEVERE [main] org.apache.catalina.util.LifecycleBase.handleSubClassException Failed to initialize component [Connector[HTTP/1.1-51529]]
 org.apache.catalina.LifecycleException: Protocol handler initialization failed
	at org.apache.catalina.connector.Connector.initInternal(Connector.java:935)
	at org.apache.catalina.util.LifecycleBase.init(LifecycleBase.java:136)
	at org.apache.catalina.util.LifecycleBase.start(LifecycleBase.java:173)
	at org.apache.catalina.connector.TestConnector.doTestDuplicatePort(TestConnector.java:149)
	at org.apache.catalina.connector.TestConnector.testDuplicatePortNoThrows(TestConnector.java:135)
	at sun.reflect.NativeMethodAccessorImpl.invoke0(Native Method)
	at sun.reflect.NativeMethodAccessorImpl.invoke(NativeMethodAccessorImpl.java:62)
	at sun.reflect.DelegatingMethodAccessorImpl.invoke(DelegatingMethodAccessorImpl.java:43)
	at java.lang.reflect.Method.invoke(Method.java:498)
	at org.junit.runners.model.FrameworkMethod$1.runReflectiveCall(FrameworkMethod.java:59)
	at org.junit.internal.runners.model.ReflectiveCallable.run(ReflectiveCallable.java:12)
	at org.junit.runners.model.FrameworkMethod.invokeExplosively(FrameworkMethod.java:61)
	at org.junit.internal.runners.statements.InvokeMethod.evaluate(InvokeMethod.java:17)
	at org.junit.internal.runners.statements.RunBefores.evaluate(RunBefores.java:26)
	at org.junit.internal.runners.statements.RunAfters.evaluate(RunAfters.java:27)
	at org.junit.rules.TestWatcher$1.evaluate(TestWatcher.java:55)
	at org.junit.runners.BlockJUnit4ClassRunner$1.evaluate(BlockJUnit4ClassRunner.java:100)
	at org.junit.runners.ParentRunner.runLeaf(ParentRunner.java:346)
	at org.junit.runners.BlockJUnit4ClassRunner.runChild(BlockJUnit4ClassRunner.java:103)
	at org.junit.runners.BlockJUnit4ClassRunner.runChild(BlockJUnit4ClassRunner.java:63)
	at org.junit.runners.ParentRunner$3.run(ParentRunner.java:311)
	at org.junit.runners.ParentRunner$1.schedule(ParentRunner.java:76)
	at org.junit.runners.ParentRunner.runChildren(ParentRunner.java:309)
	at org.junit.runners.ParentRunner.access$100(ParentRunner.java:63)
	at org.junit.runners.ParentRunner$2.evaluate(ParentRunner.java:289)
	at org.junit.internal.runners.statements.RunBefores.evaluate(RunBefores.java:26)
	at org.junit.internal.runners.statements.RunAfters.evaluate(RunAfters.java:27)
	at org.junit.runners.ParentRunner.run(ParentRunner.java:393)
	at junit.framework.JUnit4TestAdapter.run(JUnit4TestAdapter.java:48)
	at org.apache.tools.ant.taskdefs.optional.junit.JUnitTestRunner.run(JUnitTestRunner.java:539)
	at org.apache.tools.ant.taskdefs.optional.junit.JUnitTestRunner.launch(JUnitTestRunner.java:1210)
	at org.apache.tools.ant.taskdefs.optional.junit.JUnitTestRunner.main(JUnitTestRunner.java:1052)
Caused by: java.net.BindException: Address already in use
	at sun.nio.ch.Net.bind0(Native Method)
	at sun.nio.ch.Net.bind(Net.java:433)
	at sun.nio.ch.Net.bind(Net.java:425)
	at sun.nio.ch.ServerSocketChannelImpl.bind(ServerSocketChannelImpl.java:223)
	at sun.nio.ch.ServerSocketAdaptor.bind(ServerSocketAdaptor.java:74)
	at org.apache.tomcat.util.net.NioEndpoint.initServerSocket(NioEndpoint.java:227)
	at org.apache.tomcat.util.net.NioEndpoint.bind(NioEndpoint.java:202)
	at org.apache.tomcat.util.net.AbstractEndpoint.init(AbstractEndpoint.java:1039)
	at org.apache.coyote.AbstractProtocol.init(AbstractProtocol.java:540)
	at org.apache.coyote.http11.AbstractHttp11Protocol.init(AbstractHttp11Protocol.java:70)
	at org.apache.catalina.connector.Connector.initInternal(Connector.java:932)
	... 31 more

25-Sep-2017 03:12:56.884 INFO [main] org.apache.coyote.AbstractProtocol.start Starting ProtocolHandler ["http-nio-51529"]
25-Sep-2017 03:12:56.884 SEVERE [main] org.apache.catalina.util.LifecycleBase.handleSubClassException Failed to start component [Connector[HTTP/1.1-51529]]
 org.apache.catalina.LifecycleException: Protocol handler start failed
	at org.apache.catalina.connector.Connector.startInternal(Connector.java:960)
	at org.apache.catalina.util.LifecycleBase.start(LifecycleBase.java:183)
	at org.apache.catalina.connector.TestConnector.doTestDuplicatePort(TestConnector.java:149)
	at org.apache.catalina.connector.TestConnector.testDuplicatePortNoThrows(TestConnector.java:135)
	at sun.reflect.NativeMethodAccessorImpl.invoke0(Native Method)
	at sun.reflect.NativeMethodAccessorImpl.invoke(NativeMethodAccessorImpl.java:62)
	at sun.reflect.DelegatingMethodAccessorImpl.invoke(DelegatingMethodAccessorImpl.java:43)
	at java.lang.reflect.Method.invoke(Method.java:498)
	at org.junit.runners.model.FrameworkMethod$1.runReflectiveCall(FrameworkMethod.java:59)
	at org.junit.internal.runners.model.ReflectiveCallable.run(ReflectiveCallable.java:12)
	at org.junit.runners.model.FrameworkMethod.invokeExplosively(FrameworkMethod.java:61)
	at org.junit.internal.runners.statements.InvokeMethod.evaluate(InvokeMethod.java:17)
	at org.junit.internal.runners.statements.RunBefores.evaluate(RunBefores.java:26)
	at org.junit.internal.runners.statements.RunAfters.evaluate(RunAfters.java:27)
	at org.junit.rules.TestWatcher$1.evaluate(TestWatcher.java:55)
	at org.junit.runners.BlockJUnit4ClassRunner$1.evaluate(BlockJUnit4ClassRunner.java:100)
	at org.junit.runners.ParentRunner.runLeaf(ParentRunner.java:346)
	at org.junit.runners.BlockJUnit4ClassRunner.runChild(BlockJUnit4ClassRunner.java:103)
	at org.junit.runners.BlockJUnit4ClassRunner.runChild(BlockJUnit4ClassRunner.java:63)
	at org.junit.runners.ParentRunner$3.run(ParentRunner.java:311)
	at org.junit.runners.ParentRunner$1.schedule(ParentRunner.java:76)
	at org.junit.runners.ParentRunner.runChildren(ParentRunner.java:309)
	at org.junit.runners.ParentRunner.access$100(ParentRunner.java:63)
	at org.junit.runners.ParentRunner$2.evaluate(ParentRunner.java:289)
	at org.junit.internal.runners.statements.RunBefores.evaluate(RunBefores.java:26)
	at org.junit.internal.runners.statements.RunAfters.evaluate(RunAfters.java:27)
	at org.junit.runners.ParentRunner.run(ParentRunner.java:393)
	at junit.framework.JUnit4TestAdapter.run(JUnit4TestAdapter.java:48)
	at org.apache.tools.ant.taskdefs.optional.junit.JUnitTestRunner.run(JUnitTestRunner.java:539)
	at org.apache.tools.ant.taskdefs.optional.junit.JUnitTestRunner.launch(JUnitTestRunner.java:1210)
	at org.apache.tools.ant.taskdefs.optional.junit.JUnitTestRunner.main(JUnitTestRunner.java:1052)
Caused by: java.net.BindException: Address already in use
	at sun.nio.ch.Net.bind0(Native Method)
	at sun.nio.ch.Net.bind(Net.java:433)
	at sun.nio.ch.Net.bind(Net.java:425)
	at sun.nio.ch.ServerSocketChannelImpl.bind(ServerSocketChannelImpl.java:223)
	at sun.nio.ch.ServerSocketAdaptor.bind(ServerSocketAdaptor.java:74)
	at org.apache.tomcat.util.net.NioEndpoint.initServerSocket(NioEndpoint.java:227)
	at org.apache.tomcat.util.net.NioEndpoint.bind(NioEndpoint.java:202)
	at org.apache.tomcat.util.net.AbstractEndpoint.start(AbstractEndpoint.java:1103)
	at org.apache.coyote.AbstractProtocol.start(AbstractProtocol.java:550)
	at org.apache.catalina.connector.Connector.startInternal(Connector.java:957)
	... 30 more

25-Sep-2017 03:12:56.885 INFO [main] org.apache.coyote.AbstractProtocol.destroy Destroying ProtocolHandler ["http-nio-127.0.0.1-auto-4"]
25-Sep-2017 03:12:56.885 INFO [main] org.apache.catalina.startup.LoggingBaseTest.setUp Starting test case [testTraceNotAllowedDefault]
25-Sep-2017 03:12:56.889 INFO [main] org.apache.coyote.AbstractProtocol.init Initializing ProtocolHandler ["http-nio-127.0.0.1-auto-5"]
25-Sep-2017 03:12:56.890 INFO [main] org.apache.tomcat.util.net.NioSelectorPool.getSharedSelector Using a shared selector for servlet write/read
25-Sep-2017 03:12:56.893 INFO [main] org.apache.catalina.core.StandardService.startInternal Starting service [Tomcat]
25-Sep-2017 03:12:56.893 INFO [main] org.apache.catalina.core.StandardEngine.startInternal Starting Servlet Engine: Apache Tomcat/9.0.1-dev
25-Sep-2017 03:12:56.898 INFO [main] org.apache.coyote.AbstractProtocol.start Starting ProtocolHandler ["http-nio-127.0.0.1-auto-5-56532"]
25-Sep-2017 03:12:56.903 INFO [main] org.apache.coyote.AbstractProtocol.pause Pausing ProtocolHandler ["http-nio-127.0.0.1-auto-5-56532"]
25-Sep-2017 03:12:56.953 INFO [main] org.apache.catalina.core.StandardService.stopInternal Stopping service [Tomcat]
25-Sep-2017 03:12:56.955 INFO [main] org.apache.coyote.AbstractProtocol.stop Stopping ProtocolHandler ["http-nio-127.0.0.1-auto-5-56532"]
25-Sep-2017 03:12:56.956 INFO [main] org.apache.coyote.AbstractProtocol.destroy Destroying ProtocolHandler ["http-nio-127.0.0.1-auto-5-56532"]
25-Sep-2017 03:12:56.958 INFO [main] org.apache.catalina.startup.LoggingBaseTest.setUp Starting test case [testTraceAllowedDefault]
25-Sep-2017 03:12:56.959 INFO [main] org.apache.coyote.AbstractProtocol.init Initializing ProtocolHandler ["http-nio-127.0.0.1-auto-6"]
25-Sep-2017 03:12:56.960 INFO [main] org.apache.tomcat.util.net.NioSelectorPool.getSharedSelector Using a shared selector for servlet write/read
25-Sep-2017 03:12:56.970 INFO [main] org.apache.catalina.core.StandardService.startInternal Starting service [Tomcat]
25-Sep-2017 03:12:56.970 INFO [main] org.apache.catalina.core.StandardEngine.startInternal Starting Servlet Engine: Apache Tomcat/9.0.1-dev
25-Sep-2017 03:12:56.979 INFO [main] org.apache.coyote.AbstractProtocol.start Starting ProtocolHandler ["http-nio-127.0.0.1-auto-6-42123"]
25-Sep-2017 03:12:56.984 INFO [main] org.apache.coyote.AbstractProtocol.pause Pausing ProtocolHandler ["http-nio-127.0.0.1-auto-6-42123"]
25-Sep-2017 03:12:57.035 INFO [main] org.apache.catalina.core.StandardService.stopInternal Stopping service [Tomcat]
25-Sep-2017 03:12:57.036 INFO [main] org.apache.coyote.AbstractProtocol.stop Stopping ProtocolHandler ["http-nio-127.0.0.1-auto-6-42123"]
25-Sep-2017 03:12:57.041 INFO [main] org.apache.coyote.AbstractProtocol.destroy Destroying ProtocolHandler ["http-nio-127.0.0.1-auto-6-42123"]
25-Sep-2017 03:12:57.043 INFO [main] org.apache.catalina.startup.LoggingBaseTest.setUp Starting test case [testPort]
25-Sep-2017 03:12:57.044 INFO [main] org.apache.coyote.AbstractProtocol.init Initializing ProtocolHandler ["http-nio-127.0.0.1-auto-7"]
25-Sep-2017 03:12:57.045 INFO [main] org.apache.tomcat.util.net.NioSelectorPool.getSharedSelector Using a shared selector for servlet write/read
25-Sep-2017 03:12:57.045 INFO [main] org.apache.coyote.AbstractProtocol.init Initializing ProtocolHandler ["http-nio-auto-8"]
25-Sep-2017 03:12:57.046 INFO [main] org.apache.tomcat.util.net.NioSelectorPool.getSharedSelector Using a shared selector for servlet write/read
25-Sep-2017 03:12:57.046 INFO [main] org.apache.catalina.core.StandardService.startInternal Starting service [Tomcat]
25-Sep-2017 03:12:57.046 INFO [main] org.apache.catalina.core.StandardEngine.startInternal Starting Servlet Engine: Apache Tomcat/9.0.1-dev
25-Sep-2017 03:12:57.047 INFO [main] org.apache.coyote.AbstractProtocol.start Starting ProtocolHandler ["http-nio-127.0.0.1-auto-7-50350"]
25-Sep-2017 03:12:57.049 INFO [main] org.apache.coyote.AbstractProtocol.start Starting ProtocolHandler ["http-nio-auto-8-44844"]
25-Sep-2017 03:12:57.052 INFO [main] org.apache.coyote.AbstractProtocol.pause Pausing ProtocolHandler ["http-nio-127.0.0.1-auto-7-50350"]
25-Sep-2017 03:12:57.102 INFO [main] org.apache.coyote.AbstractProtocol.pause Pausing ProtocolHandler ["http-nio-auto-8-44844"]
25-Sep-2017 03:12:57.153 INFO [main] org.apache.catalina.core.StandardService.stopInternal Stopping service [Tomcat]
25-Sep-2017 03:12:57.154 INFO [main] org.apache.coyote.AbstractProtocol.stop Stopping ProtocolHandler ["http-nio-127.0.0.1-auto-7-50350"]
25-Sep-2017 03:12:57.155 INFO [main] org.apache.coyote.AbstractProtocol.stop Stopping ProtocolHandler ["http-nio-auto-8-44844"]
25-Sep-2017 03:12:57.157 INFO [main] org.apache.coyote.AbstractProtocol.destroy Destroying ProtocolHandler ["http-nio-127.0.0.1-auto-7-50350"]
25-Sep-2017 03:12:57.158 INFO [main] org.apache.coyote.AbstractProtocol.destroy Destroying ProtocolHandler ["http-nio-auto-8-44844"]
25-Sep-2017 03:12:57.161 INFO [main] org.apache.catalina.startup.LoggingBaseTest.setUp Starting test case [testStop]
25-Sep-2017 03:12:57.162 INFO [main] org.apache.coyote.AbstractProtocol.init Initializing ProtocolHandler ["http-nio-127.0.0.1-auto-9"]
25-Sep-2017 03:12:57.163 INFO [main] org.apache.tomcat.util.net.NioSelectorPool.getSharedSelector Using a shared selector for servlet write/read
25-Sep-2017 03:12:57.165 INFO [main] org.apache.catalina.core.StandardService.startInternal Starting service [Tomcat]
25-Sep-2017 03:12:57.165 INFO [main] org.apache.catalina.core.StandardEngine.startInternal Starting Servlet Engine: Apache Tomcat/9.0.1-dev
25-Sep-2017 03:12:57.170 INFO [main] org.apache.coyote.AbstractProtocol.start Starting ProtocolHandler ["http-nio-127.0.0.1-auto-9-60569"]
25-Sep-2017 03:12:57.178 INFO [main] org.apache.coyote.AbstractProtocol.stop Stopping ProtocolHandler ["http-nio-127.0.0.1-auto-9-60569"]
25-Sep-2017 03:12:58.231 INFO [main] org.apache.coyote.AbstractProtocol.pause Pausing ProtocolHandler ["http-nio-127.0.0.1-auto-9-60569"]
25-Sep-2017 03:12:58.232 INFO [main] org.apache.catalina.core.StandardService.stopInternal Stopping service [Tomcat]
25-Sep-2017 03:12:58.233 INFO [main] org.apache.coyote.AbstractProtocol.destroy Destroying ProtocolHandler ["http-nio-127.0.0.1-auto-9-60569"]
25-Sep-2017 03:12:58.235 INFO [main] org.apache.catalina.startup.LoggingBaseTest.setUp Starting test case [testInvalidProtocolNoThrows]
25-Sep-2017 03:12:58.236 SEVERE [main] org.apache.catalina.connector.Connector.<init> Protocol handler instantiation failed
 java.lang.ClassNotFoundException: foo.Bar
	at java.net.URLClassLoader.findClass(URLClassLoader.java:381)
	at java.lang.ClassLoader.loadClass(ClassLoader.java:424)
	at sun.misc.Launcher$AppClassLoader.loadClass(Launcher.java:335)
	at java.lang.ClassLoader.loadClass(ClassLoader.java:357)
	at java.lang.Class.forName0(Native Method)
	at java.lang.Class.forName(Class.java:264)
	at org.apache.catalina.connector.Connector.<init>(Connector.java:101)
	at org.apache.catalina.connector.TestConnector.doTestInvalidProtocol(TestConnector.java:120)
	at org.apache.catalina.connector.TestConnector.testInvalidProtocolNoThrows(TestConnector.java:115)
	at sun.reflect.NativeMethodAccessorImpl.invoke0(Native Method)
	at sun.reflect.NativeMethodAccessorImpl.invoke(NativeMethodAccessorImpl.java:62)
	at sun.reflect.DelegatingMethodAccessorImpl.invoke(DelegatingMethodAccessorImpl.java:43)
	at java.lang.reflect.Method.invoke(Method.java:498)
	at org.junit.runners.model.FrameworkMethod$1.runReflectiveCall(FrameworkMethod.java:59)
	at org.junit.internal.runners.model.ReflectiveCallable.run(ReflectiveCallable.java:12)
	at org.junit.runners.model.FrameworkMethod.invokeExplosively(FrameworkMethod.java:61)
	at org.junit.internal.runners.statements.InvokeMethod.evaluate(InvokeMethod.java:17)
	at org.junit.internal.runners.statements.RunBefores.evaluate(RunBefores.java:26)
	at org.junit.internal.runners.statements.RunAfters.evaluate(RunAfters.java:27)
	at org.junit.rules.TestWatcher$1.evaluate(TestWatcher.java:55)
	at org.junit.runners.BlockJUnit4ClassRunner$1.evaluate(BlockJUnit4ClassRunner.java:100)
	at org.junit.runners.ParentRunner.runLeaf(ParentRunner.java:346)
	at org.junit.runners.BlockJUnit4ClassRunner.runChild(BlockJUnit4ClassRunner.java:103)
	at org.junit.runners.BlockJUnit4ClassRunner.runChild(BlockJUnit4ClassRunner.java:63)
	at org.junit.runners.ParentRunner$3.run(ParentRunner.java:311)
	at org.junit.runners.ParentRunner$1.schedule(ParentRunner.java:76)
	at org.junit.runners.ParentRunner.runChildren(ParentRunner.java:309)
	at org.junit.runners.ParentRunner.access$100(ParentRunner.java:63)
	at org.junit.runners.ParentRunner$2.evaluate(ParentRunner.java:289)
	at org.junit.internal.runners.statements.RunBefores.evaluate(RunBefores.java:26)
	at org.junit.internal.runners.statements.RunAfters.evaluate(RunAfters.java:27)
	at org.junit.runners.ParentRunner.run(ParentRunner.java:393)
	at junit.framework.JUnit4TestAdapter.run(JUnit4TestAdapter.java:48)
	at org.apache.tools.ant.taskdefs.optional.junit.JUnitTestRunner.run(JUnitTestRunner.java:539)
	at org.apache.tools.ant.taskdefs.optional.junit.JUnitTestRunner.launch(JUnitTestRunner.java:1210)
	at org.apache.tools.ant.taskdefs.optional.junit.JUnitTestRunner.main(JUnitTestRunner.java:1052)

Continuation...

25-Sep-2017 03:12:58.237 SEVERE [main] org.apache.catalina.util.LifecycleBase.handleSubClassException Failed to initialize component [Connector[foo.Bar-auto-null]]
 org.apache.catalina.LifecycleException: Protocol handler instantiation failed
	at org.apache.catalina.connector.Connector.initInternal(Connector.java:904)
	at org.apache.catalina.util.LifecycleBase.init(LifecycleBase.java:136)
	at org.apache.catalina.util.LifecycleBase.start(LifecycleBase.java:173)
	at org.apache.catalina.connector.TestConnector.doTestInvalidProtocol(TestConnector.java:123)
	at org.apache.catalina.connector.TestConnector.testInvalidProtocolNoThrows(TestConnector.java:115)
	at sun.reflect.NativeMethodAccessorImpl.invoke0(Native Method)
	at sun.reflect.NativeMethodAccessorImpl.invoke(NativeMethodAccessorImpl.java:62)
	at sun.reflect.DelegatingMethodAccessorImpl.invoke(DelegatingMethodAccessorImpl.java:43)
	at java.lang.reflect.Method.invoke(Method.java:498)
	at org.junit.runners.model.FrameworkMethod$1.runReflectiveCall(FrameworkMethod.java:59)
	at org.junit.internal.runners.model.ReflectiveCallable.run(ReflectiveCallable.java:12)
	at org.junit.runners.model.FrameworkMethod.invokeExplosively(FrameworkMethod.java:61)
	at org.junit.internal.runners.statements.InvokeMethod.evaluate(InvokeMethod.java:17)
	at org.junit.internal.runners.statements.RunBefores.evaluate(RunBefores.java:26)
	at org.junit.internal.runners.statements.RunAfters.evaluate(RunAfters.java:27)
	at org.junit.rules.TestWatcher$1.evaluate(TestWatcher.java:55)
	at org.junit.runners.BlockJUnit4ClassRunner$1.evaluate(BlockJUnit4ClassRunner.java:100)
	at org.junit.runners.ParentRunner.runLeaf(ParentRunner.java:346)
	at org.junit.runners.BlockJUnit4ClassRunner.runChild(BlockJUnit4ClassRunner.java:103)
	at org.junit.runners.BlockJUnit4ClassRunner.runChild(BlockJUnit4ClassRunner.java:63)
	at org.junit.runners.ParentRunner$3.run(ParentRunner.java:311)
	at org.junit.runners.ParentRunner$1.schedule(ParentRunner.java:76)
	at org.junit.runners.ParentRunner.runChildren(ParentRunner.java:309)
	at org.junit.runners.ParentRunner.access$100(ParentRunner.java:63)
	at org.junit.runners.ParentRunner$2.evaluate(ParentRunner.java:289)
	at org.junit.internal.runners.statements.RunBefores.evaluate(RunBefores.java:26)
	at org.junit.internal.runners.statements.RunAfters.evaluate(RunAfters.java:27)
	at org.junit.runners.ParentRunner.run(ParentRunner.java:393)
	at junit.framework.JUnit4TestAdapter.run(JUnit4TestAdapter.java:48)
	at org.apache.tools.ant.taskdefs.optional.junit.JUnitTestRunner.run(JUnitTestRunner.java:539)
	at org.apache.tools.ant.taskdefs.optional.junit.JUnitTestRunner.launch(JUnitTestRunner.java:1210)
	at org.apache.tools.ant.taskdefs.optional.junit.JUnitTestRunner.main(JUnitTestRunner.java:1052)

25-Sep-2017 03:12:58.238 SEVERE [main] org.apache.catalina.util.LifecycleBase.handleSubClassException Failed to start component [Connector[foo.Bar-auto-null]]
 org.apache.catalina.LifecycleException: The connector cannot start since the specified port value of [-1] is invalid
	at org.apache.catalina.connector.Connector.startInternal(Connector.java:950)
	at org.apache.catalina.util.LifecycleBase.start(LifecycleBase.java:183)
	at org.apache.catalina.connector.TestConnector.doTestInvalidProtocol(TestConnector.java:123)
	at org.apache.catalina.connector.TestConnector.testInvalidProtocolNoThrows(TestConnector.java:115)
	at sun.reflect.NativeMethodAccessorImpl.invoke0(Native Method)
	at sun.reflect.NativeMethodAccessorImpl.invoke(NativeMethodAccessorImpl.java:62)
	at sun.reflect.DelegatingMethodAccessorImpl.invoke(DelegatingMethodAccessorImpl.java:43)
	at java.lang.reflect.Method.invoke(Method.java:498)
	at org.junit.runners.model.FrameworkMethod$1.runReflectiveCall(FrameworkMethod.java:59)
	at org.junit.internal.runners.model.ReflectiveCallable.run(ReflectiveCallable.java:12)
	at org.junit.runners.model.FrameworkMethod.invokeExplosively(FrameworkMethod.java:61)
	at org.junit.internal.runners.statements.InvokeMethod.evaluate(InvokeMethod.java:17)
	at org.junit.internal.runners.statements.RunBefores.evaluate(RunBefores.java:26)
	at org.junit.internal.runners.statements.RunAfters.evaluate(RunAfters.java:27)
	at org.junit.rules.TestWatcher$1.evaluate(TestWatcher.java:55)
	at org.junit.runners.BlockJUnit4ClassRunner$1.evaluate(BlockJUnit4ClassRunner.java:100)
	at org.junit.runners.ParentRunner.runLeaf(ParentRunner.java:346)
	at org.junit.runners.BlockJUnit4ClassRunner.runChild(BlockJUnit4ClassRunner.java:103)
	at org.junit.runners.BlockJUnit4ClassRunner.runChild(BlockJUnit4ClassRunner.java:63)
	at org.junit.runners.ParentRunner$3.run(ParentRunner.java:311)
	at org.junit.runners.ParentRunner$1.schedule(ParentRunner.java:76)
	at org.junit.runners.ParentRunner.runChildren(ParentRunner.java:309)
	at org.junit.runners.ParentRunner.access$100(ParentRunner.java:63)
	at org.junit.runners.ParentRunner$2.evaluate(ParentRunner.java:289)
	at org.junit.internal.runners.statements.RunBefores.evaluate(RunBefores.java:26)
	at org.junit.internal.runners.statements.RunAfters.evaluate(RunAfters.java:27)
	at org.junit.runners.ParentRunner.run(ParentRunner.java:393)
	at junit.framework.JUnit4TestAdapter.run(JUnit4TestAdapter.java:48)
	at org.apache.tools.ant.taskdefs.optional.junit.JUnitTestRunner.run(JUnitTestRunner.java:539)
	at org.apache.tools.ant.taskdefs.optional.junit.JUnitTestRunner.launch(JUnitTestRunner.java:1210)
	at org.apache.tools.ant.taskdefs.optional.junit.JUnitTestRunner.main(JUnitTestRunner.java:1052)

25-Sep-2017 03:12:58.238 INFO [main] org.apache.coyote.AbstractProtocol.destroy Destroying ProtocolHandler ["http-nio-127.0.0.1-auto-10"]
25-Sep-2017 03:12:58.239 INFO [main] org.apache.catalina.startup.LoggingBaseTest.setUp Starting test case [testTraceNotAllowedCustom]
25-Sep-2017 03:12:58.241 INFO [main] org.apache.coyote.AbstractProtocol.init Initializing ProtocolHandler ["http-nio-127.0.0.1-auto-11"]
25-Sep-2017 03:12:58.241 INFO [main] org.apache.tomcat.util.net.NioSelectorPool.getSharedSelector Using a shared selector for servlet write/read
25-Sep-2017 03:12:58.241 INFO [main] org.apache.catalina.core.StandardService.startInternal Starting service [Tomcat]
25-Sep-2017 03:12:58.241 INFO [main] org.apache.catalina.core.StandardEngine.startInternal Starting Servlet Engine: Apache Tomcat/9.0.1-dev
25-Sep-2017 03:12:58.246 INFO [main] org.apache.coyote.AbstractProtocol.start Starting ProtocolHandler ["http-nio-127.0.0.1-auto-11-42111"]
25-Sep-2017 03:12:58.255 INFO [main] org.apache.coyote.AbstractProtocol.pause Pausing ProtocolHandler ["http-nio-127.0.0.1-auto-11-42111"]
25-Sep-2017 03:12:58.306 INFO [main] org.apache.catalina.core.StandardService.stopInternal Stopping service [Tomcat]
25-Sep-2017 03:12:58.308 INFO [main] org.apache.coyote.AbstractProtocol.stop Stopping ProtocolHandler ["http-nio-127.0.0.1-auto-11-42111"]
25-Sep-2017 03:12:58.311 INFO [main] org.apache.coyote.AbstractProtocol.destroy Destroying ProtocolHandler ["http-nio-127.0.0.1-auto-11-42111"]
25-Sep-2017 03:12:58.313 INFO [main] org.apache.catalina.startup.LoggingBaseTest.setUp Starting test case [testTraceNotAllowedWebDav]
25-Sep-2017 03:12:58.315 INFO [main] org.apache.coyote.AbstractProtocol.init Initializing ProtocolHandler ["http-nio-127.0.0.1-auto-12"]
25-Sep-2017 03:12:58.315 INFO [main] org.apache.tomcat.util.net.NioSelectorPool.getSharedSelector Using a shared selector for servlet write/read
25-Sep-2017 03:12:58.315 INFO [main] org.apache.catalina.core.StandardService.startInternal Starting service [Tomcat]
25-Sep-2017 03:12:58.315 INFO [main] org.apache.catalina.core.StandardEngine.startInternal Starting Servlet Engine: Apache Tomcat/9.0.1-dev
25-Sep-2017 03:12:58.320 INFO [main] org.apache.coyote.AbstractProtocol.start Starting ProtocolHandler ["http-nio-127.0.0.1-auto-12-34514"]
25-Sep-2017 03:12:58.324 INFO [main] org.apache.coyote.AbstractProtocol.pause Pausing ProtocolHandler ["http-nio-127.0.0.1-auto-12-34514"]
25-Sep-2017 03:12:58.374 INFO [main] org.apache.catalina.core.StandardService.stopInternal Stopping service [Tomcat]
25-Sep-2017 03:12:58.376 INFO [main] org.apache.coyote.AbstractProtocol.stop Stopping ProtocolHandler ["http-nio-127.0.0.1-auto-12-34514"]
25-Sep-2017 03:12:58.377 INFO [main] org.apache.coyote.AbstractProtocol.destroy Destroying ProtocolHandler ["http-nio-127.0.0.1-auto-12-34514"]
25-Sep-2017 03:12:58.379 INFO [main] org.apache.catalina.startup.LoggingBaseTest.setUp Starting test case [testInvalidProtocolThrows]
25-Sep-2017 03:12:58.380 SEVERE [main] org.apache.catalina.connector.Connector.<init> Protocol handler instantiation failed
 java.lang.ClassNotFoundException: foo.Bar
	at java.net.URLClassLoader.findClass(URLClassLoader.java:381)
	at java.lang.ClassLoader.loadClass(ClassLoader.java:424)
	at sun.misc.Launcher$AppClassLoader.loadClass(Launcher.java:335)
	at java.lang.ClassLoader.loadClass(ClassLoader.java:357)
	at java.lang.Class.forName0(Native Method)
	at java.lang.Class.forName(Class.java:264)
	at org.apache.catalina.connector.Connector.<init>(Connector.java:101)
	at org.apache.catalina.connector.TestConnector.doTestInvalidProtocol(TestConnector.java:120)
	at org.apache.catalina.connector.TestConnector.testInvalidProtocolThrows(TestConnector.java:109)
	at sun.reflect.NativeMethodAccessorImpl.invoke0(Native Method)
	at sun.reflect.NativeMethodAccessorImpl.invoke(NativeMethodAccessorImpl.java:62)
	at sun.reflect.DelegatingMethodAccessorImpl.invoke(DelegatingMethodAccessorImpl.java:43)
	at java.lang.reflect.Method.invoke(Method.java:498)
	at org.junit.runners.model.FrameworkMethod$1.runReflectiveCall(FrameworkMethod.java:59)
	at org.junit.internal.runners.model.ReflectiveCallable.run(ReflectiveCallable.java:12)
	at org.junit.runners.model.FrameworkMethod.invokeExplosively(FrameworkMethod.java:61)
	at org.junit.internal.runners.statements.InvokeMethod.evaluate(InvokeMethod.java:17)
	at org.junit.internal.runners.statements.ExpectException.evaluate(ExpectException.java:19)
	at org.junit.internal.runners.statements.RunBefores.evaluate(RunBefores.java:26)
	at org.junit.internal.runners.statements.RunAfters.evaluate(RunAfters.java:27)
	at org.junit.rules.TestWatcher$1.evaluate(TestWatcher.java:55)
	at org.junit.runners.BlockJUnit4ClassRunner$1.evaluate(BlockJUnit4ClassRunner.java:100)
	at org.junit.runners.ParentRunner.runLeaf(ParentRunner.java:346)
	at org.junit.runners.BlockJUnit4ClassRunner.runChild(BlockJUnit4ClassRunner.java:103)
	at org.junit.runners.BlockJUnit4ClassRunner.runChild(BlockJUnit4ClassRunner.java:63)
	at org.junit.runners.ParentRunner$3.run(ParentRunner.java:311)
	at org.junit.runners.ParentRunner$1.schedule(ParentRunner.java:76)
	at org.junit.runners.ParentRunner.runChildren(ParentRunner.java:309)
	at org.junit.runners.ParentRunner.access$100(ParentRunner.java:63)
	at org.junit.runners.ParentRunner$2.evaluate(ParentRunner.java:289)
	at org.junit.internal.runners.statements.RunBefores.evaluate(RunBefores.java:26)
	at org.junit.internal.runners.statements.RunAfters.evaluate(RunAfters.java:27)
	at org.junit.runners.ParentRunner.run(ParentRunner.java:393)
	at junit.framework.JUnit4TestAdapter.run(JUnit4TestAdapter.java:48)
	at org.apache.tools.ant.taskdefs.optional.junit.JUnitTestRunner.run(JUnitTestRunner.java:539)
	at org.apache.tools.ant.taskdefs.optional.junit.JUnitTestRunner.launch(JUnitTestRunner.java:1210)
	at org.apache.tools.ant.taskdefs.optional.junit.JUnitTestRunner.main(JUnitTestRunner.java:1052)

25-Sep-2017 03:12:58.381 INFO [main] org.apache.coyote.AbstractProtocol.destroy Destroying ProtocolHandler ["http-nio-127.0.0.1-auto-13"]
25-Sep-2017 03:12:58.381 INFO [main] org.apache.catalina.startup.LoggingBaseTest.setUp Starting test case [testDuplicatePortThrows]
25-Sep-2017 03:12:58.383 INFO [main] org.apache.coyote.AbstractProtocol.init Initializing ProtocolHandler ["http-nio-auto-14"]
25-Sep-2017 03:12:58.384 INFO [main] org.apache.tomcat.util.net.NioSelectorPool.getSharedSelector Using a shared selector for servlet write/read
25-Sep-2017 03:12:58.384 INFO [main] org.apache.coyote.AbstractProtocol.start Starting ProtocolHandler ["http-nio-auto-14-33040"]
25-Sep-2017 03:12:58.386 INFO [main] org.apache.coyote.AbstractProtocol.init Initializing ProtocolHandler ["http-nio-33040"]
25-Sep-2017 03:12:58.387 INFO [main] org.apache.coyote.AbstractProtocol.destroy Destroying ProtocolHandler ["http-nio-127.0.0.1-auto-15"]
------------- ---------------- ---------------

Testcase: testTraceAllowedCustom took 0.638 sec
Testcase: testTraceAllowedWebDav took 0.086 sec
Testcase: testDuplicatePortNoThrows took 0.007 sec
Testcase: testTraceNotAllowedDefault took 0.072 sec
Testcase: testTraceAllowedDefault took 0.085 sec
Testcase: testPort took 0.117 sec
Testcase: testStop took 1.075 sec
Testcase: testInvalidProtocolNoThrows took 0.003 sec
Testcase: testTraceNotAllowedCustom took 0.074 sec
Testcase: testTraceNotAllowedWebDav took 0.066 sec
Testcase: testInvalidProtocolThrows took 0.003 sec
Testcase: testDuplicatePortThrows took 0.006 sec

Apache Gump, Gump, Apache, the Apache feather logo, and the Apache Gump project logos are trademarks of The Apache Software Foundation.

Last Updated: Mon, 25 Sep 2017 00:00:08 ().Python Logo