Run| Workspace| Log| Issues| Fixes| Pre-reqs| Stats| XRef| Maven Repository Proxy Log Gump Logo

Details

File Contents

Testsuite: org.apache.catalina.valves.TestSSLValve
Tests run: 17, Failures: 0, Errors: 0, Skipped: 0, Time elapsed: 0.383 sec
------------- Standard Error -----------------
Nov 22, 2017 4:48:55 AM org.apache.catalina.valves.SSLValve invoke
WARNING: Failed to process certificate string [-----BEGIN CERTIFICATE-----
 MIIFXTCCA0WgAwIBAgIJANFf3YTJgYifMA0GCSqGSIb3DQEBCwUAMEUxCzAJBgNV BAYTAkFVMRMwEQYDVQQIDApTb21lLVN0YXRlMSEwHwYDVQQKDBhJbnRlcm5ldCBX aWRnaXRzIFB0eSBMdGQwHhcNMTcwNTI2MjEzNjM3WhcNMTgwNTI2MjEzNjM3WjBF MQswCQYDVQQGEwJBVTETMBEGA1UECAwKU29tZS1TdGF0ZTEhMB8GA1UECgwYSW50 ZXJuZXQgV2lkZ2l0cyBQdHkgTHRkMIICIjANBgkqhkiG9w0BAQEFAAOCAg8AMIIC CgKCAgEA2ykNBanZz4cVITNpZcWNVmErUzqgSNrK361mj9vEdB1UkHatwal9jVrR QvFgfiZ8Gl+/85t0ebJhJ+rIr1ww6JE7v2s2MThENj95K5EwZOmgvw+CBlBYsFIz 8BtjlVYy+v7RaGPXfjrFkexQP9UIaiIIog2ClDZirRvb+QxS930/YW5Qo+X6EX6W /m/HvlorD25U4ni2FQ0y+EMO2e1jD88cAAMoP5f+Mf6NBK8I6yUeaSuMq7WqtHGV e4F1WOg5z9J5c/M69rB0iQr5NUQwZ1mPYf5Kr0P6+TLh8DJphbVvmHJyT3bgofeV JYl/kdjiXS5P/jwY9tfmhu04tsyzopWRUFCcj5zCiqZYaMn0wtDn08KaAh9oOlg8 Z6mJ9i5EybkLm63W7z7LxuM+qnYzq4wKkKdx8hbpASwPqzJkJeXFL/LzhKdZuHiR clgPVYnm98URwhObh073dKguG/gkhcnpXcVBBVdVTJZYGBvTpQh0afXd9bcBwOzY t4MDpGiQB2fLzBOEZhQ37kUcWPmZw5bNPxhx4yE96Md0rx/Gu4ipAHuqLemb1SL5] to create a java.security.cert.X509Certificate object
java.security.cert.CertificateException: Could not parse certificate: java.io.IOException: Incomplete data
	at sun.security.provider.X509Factory.engineGenerateCertificate(X509Factory.java:110)
	at java.security.cert.CertificateFactory.generateCertificate(CertificateFactory.java:339)
	at org.apache.catalina.valves.SSLValve.invoke(SSLValve.java:159)
	at org.apache.catalina.valves.TestSSLValve.testSslClientCertBadFormat(TestSSLValve.java:236)
	at sun.reflect.NativeMethodAccessorImpl.invoke0(Native Method)
	at sun.reflect.NativeMethodAccessorImpl.invoke(NativeMethodAccessorImpl.java:62)
	at sun.reflect.DelegatingMethodAccessorImpl.invoke(DelegatingMethodAccessorImpl.java:43)
	at java.lang.reflect.Method.invoke(Method.java:498)
	at org.junit.runners.model.FrameworkMethod$1.runReflectiveCall(FrameworkMethod.java:59)
	at org.junit.internal.runners.model.ReflectiveCallable.run(ReflectiveCallable.java:12)
	at org.junit.runners.model.FrameworkMethod.invokeExplosively(FrameworkMethod.java:61)
	at org.junit.internal.runners.statements.InvokeMethod.evaluate(InvokeMethod.java:17)
	at org.junit.internal.runners.statements.RunBefores.evaluate(RunBefores.java:26)
	at org.junit.runners.BlockJUnit4ClassRunner$1.evaluate(BlockJUnit4ClassRunner.java:100)
	at org.junit.runners.ParentRunner.runLeaf(ParentRunner.java:346)
	at org.junit.runners.BlockJUnit4ClassRunner.runChild(BlockJUnit4ClassRunner.java:103)
	at org.junit.runners.BlockJUnit4ClassRunner.runChild(BlockJUnit4ClassRunner.java:63)
	at org.junit.runners.ParentRunner$3.run(ParentRunner.java:311)
	at org.junit.runners.ParentRunner$1.schedule(ParentRunner.java:76)
	at org.junit.runners.ParentRunner.runChildren(ParentRunner.java:309)
	at org.junit.runners.ParentRunner.access$100(ParentRunner.java:63)
	at org.junit.runners.ParentRunner$2.evaluate(ParentRunner.java:289)
	at org.junit.runners.ParentRunner.run(ParentRunner.java:393)
	at junit.framework.JUnit4TestAdapter.run(JUnit4TestAdapter.java:48)
	at org.apache.tools.ant.taskdefs.optional.junit.JUnitTestRunner.run(JUnitTestRunner.java:539)
	at org.apache.tools.ant.taskdefs.optional.junit.JUnitTestRunner.launch(JUnitTestRunner.java:1210)
	at org.apache.tools.ant.taskdefs.optional.junit.JUnitTestRunner.main(JUnitTestRunner.java:1052)
Caused by: java.io.IOException: Incomplete data
	at sun.security.provider.X509Factory.readOneBlock(X509Factory.java:612)
	at sun.security.provider.X509Factory.engineGenerateCertificate(X509Factory.java:96)
	... 26 more

Nov 22, 2017 4:48:55 AM org.apache.catalina.valves.SSLValve invoke
SEVERE: The SSL provider specified on the connector associated with this request of [wontBeFound] is invalid. The certificate data could not be processed.
java.security.NoSuchProviderException: no such provider: wontBeFound
	at sun.security.jca.GetInstance.getService(GetInstance.java:83)
	at sun.security.jca.GetInstance.getInstance(GetInstance.java:206)
	at java.security.cert.CertificateFactory.getInstance(CertificateFactory.java:230)
	at org.apache.catalina.valves.SSLValve.invoke(SSLValve.java:157)
	at org.apache.catalina.valves.TestSSLValve.testClientCertProviderNotFound(TestSSLValve.java:253)
	at sun.reflect.NativeMethodAccessorImpl.invoke0(Native Method)
	at sun.reflect.NativeMethodAccessorImpl.invoke(NativeMethodAccessorImpl.java:62)
	at sun.reflect.DelegatingMethodAccessorImpl.invoke(DelegatingMethodAccessorImpl.java:43)
	at java.lang.reflect.Method.invoke(Method.java:498)
	at org.junit.runners.model.FrameworkMethod$1.runReflectiveCall(FrameworkMethod.java:59)
	at org.junit.internal.runners.model.ReflectiveCallable.run(ReflectiveCallable.java:12)
	at org.junit.runners.model.FrameworkMethod.invokeExplosively(FrameworkMethod.java:61)
	at org.junit.internal.runners.statements.InvokeMethod.evaluate(InvokeMethod.java:17)
	at org.junit.internal.runners.statements.RunBefores.evaluate(RunBefores.java:26)
	at org.junit.runners.BlockJUnit4ClassRunner$1.evaluate(BlockJUnit4ClassRunner.java:100)
	at org.junit.runners.ParentRunner.runLeaf(ParentRunner.java:346)
	at org.junit.runners.BlockJUnit4ClassRunner.runChild(BlockJUnit4ClassRunner.java:103)
	at org.junit.runners.BlockJUnit4ClassRunner.runChild(BlockJUnit4ClassRunner.java:63)
	at org.junit.runners.ParentRunner$3.run(ParentRunner.java:311)
	at org.junit.runners.ParentRunner$1.schedule(ParentRunner.java:76)
	at org.junit.runners.ParentRunner.runChildren(ParentRunner.java:309)
	at org.junit.runners.ParentRunner.access$100(ParentRunner.java:63)
	at org.junit.runners.ParentRunner$2.evaluate(ParentRunner.java:289)
	at org.junit.runners.ParentRunner.run(ParentRunner.java:393)
	at junit.framework.JUnit4TestAdapter.run(JUnit4TestAdapter.java:48)
	at org.apache.tools.ant.taskdefs.optional.junit.JUnitTestRunner.run(JUnitTestRunner.java:539)
	at org.apache.tools.ant.taskdefs.optional.junit.JUnitTestRunner.launch(JUnitTestRunner.java:1210)
	at org.apache.tools.ant.taskdefs.optional.junit.JUnitTestRunner.main(JUnitTestRunner.java:1052)

------------- ---------------- ---------------

Testcase: testSslClientCertShorter took 0.283 sec
Testcase: testSslClientCertNull took 0 sec
Testcase: testSslHeaderNullName took 0 sec
Testcase: testSslClientCertIgnoredBegin took 0.024 sec
Testcase: testSslHeaderMultiples took 0 sec
Testcase: testSslHeaderNullModHeader took 0 sec
Testcase: testSslHeaderNull took 0 sec
Testcase: testSslClientCertBadFormat took 0.004 sec
Testcase: testSslCipherUserKeySizeHeaderBadFormat took 0.001 sec
Testcase: testSslCipherUserKeySizeHeaderPresent took 0 sec
Testcase: testSslSessionIdHeaderPresent took 0 sec
Testcase: testSslClientCertHeaderMultiSpace took 0.001 sec
Testcase: testSslHeader took 0 sec
Testcase: testSslCipherHeaderPresent took 0 sec
Testcase: testSslClientCertHeaderSingleSpace took 0.001 sec
Testcase: testSslClientCertHeaderTab took 0.003 sec
Testcase: testClientCertProviderNotFound took 0.04 sec

Apache Gump, Gump, Apache, the Apache feather logo, and the Apache Gump project logos are trademarks of The Apache Software Foundation.

Last Updated: Wed, 22 Nov 2017 00:00:08 ().Python Logo