Run| Workspace| Log| Issues| Fixes| Pre-reqs| Stats| XRef| Maven Repository Proxy Log Gump Logo

Details

File Contents

Testsuite: org.apache.catalina.startup.TestTomcat
Tests run: 26, Failures: 0, Errors: 0, Skipped: 0, Time elapsed: 16.538 sec
------------- Standard Error -----------------
03-Aug-2020 19:37:11.385 INFO [main] org.apache.catalina.startup.LoggingBaseTest.setUp Starting test case [testProgrammatic]
03-Aug-2020 19:37:11.721 INFO [main] org.apache.catalina.core.AprLifecycleListener.lifecycleEvent Loaded Apache Tomcat Native library [1.2.25] using APR version [1.7.0].
03-Aug-2020 19:37:11.721 INFO [main] org.apache.catalina.core.AprLifecycleListener.lifecycleEvent APR capabilities: IPv6 [true], sendfile [true], accept filters [false], random [true].
03-Aug-2020 19:37:11.730 INFO [main] org.apache.catalina.core.AprLifecycleListener.initializeSSL OpenSSL successfully initialized [OpenSSL 3.0.0-alpha6-dev ]
03-Aug-2020 19:37:12.339 INFO [main] org.apache.coyote.AbstractProtocol.init Initializing ProtocolHandler ["http-apr-127.0.0.1-auto-1"]
03-Aug-2020 19:37:12.420 INFO [main] org.apache.catalina.core.StandardService.startInternal Starting service [Tomcat]
03-Aug-2020 19:37:12.421 INFO [main] org.apache.catalina.core.StandardEngine.startInternal Starting Servlet engine: [Apache Tomcat/10.0.0-M8-dev]
03-Aug-2020 19:37:12.795 INFO [main] org.apache.coyote.AbstractProtocol.start Starting ProtocolHandler ["http-apr-127.0.0.1-auto-1-43877"]
03-Aug-2020 19:37:13.053 INFO [main] org.apache.coyote.AbstractProtocol.pause Pausing ProtocolHandler ["http-apr-127.0.0.1-auto-1-43877"]
03-Aug-2020 19:37:13.055 INFO [main] org.apache.catalina.core.StandardService.stopInternal Stopping service [Tomcat]
03-Aug-2020 19:37:13.081 INFO [main] org.apache.coyote.AbstractProtocol.stop Stopping ProtocolHandler ["http-apr-127.0.0.1-auto-1-43877"]
03-Aug-2020 19:37:13.136 INFO [main] org.apache.coyote.AbstractProtocol.destroy Destroying ProtocolHandler ["http-apr-127.0.0.1-auto-1-43877"]
03-Aug-2020 19:37:13.160 INFO [main] org.apache.catalina.startup.LoggingBaseTest.setUp Starting test case [testGetDefaultContextPerAddWebapp]
03-Aug-2020 19:37:13.179 INFO [main] org.apache.coyote.AbstractProtocol.destroy Destroying ProtocolHandler ["http-apr-127.0.0.1-auto-2"]
03-Aug-2020 19:37:13.184 INFO [main] org.apache.catalina.startup.LoggingBaseTest.setUp Starting test case [testGetCustomContextPerAddWebappWithHost]
03-Aug-2020 19:37:13.195 INFO [main] org.apache.coyote.AbstractProtocol.destroy Destroying ProtocolHandler ["http-apr-127.0.0.1-auto-3"]
03-Aug-2020 19:37:13.200 INFO [main] org.apache.catalina.startup.LoggingBaseTest.setUp Starting test case [testGetWebappConfigFileFromJarNegative]
03-Aug-2020 19:37:13.202 INFO [main] org.apache.coyote.AbstractProtocol.destroy Destroying ProtocolHandler ["http-apr-127.0.0.1-auto-4"]
03-Aug-2020 19:37:13.204 INFO [main] org.apache.catalina.startup.LoggingBaseTest.setUp Starting test case [testGetWebappConfigFileFromJar]
03-Aug-2020 19:37:13.207 INFO [main] org.apache.coyote.AbstractProtocol.destroy Destroying ProtocolHandler ["http-apr-127.0.0.1-auto-5"]
03-Aug-2020 19:37:13.209 INFO [main] org.apache.catalina.startup.LoggingBaseTest.setUp Starting test case [testGetWebappConfigFileFromDirectoryNegative]
03-Aug-2020 19:37:13.211 INFO [main] org.apache.coyote.AbstractProtocol.destroy Destroying ProtocolHandler ["http-apr-127.0.0.1-auto-6"]
03-Aug-2020 19:37:13.214 INFO [main] org.apache.catalina.startup.LoggingBaseTest.setUp Starting test case [testCustomContextConfig]
03-Aug-2020 19:37:13.221 INFO [main] org.apache.catalina.core.AprLifecycleListener.lifecycleEvent Loaded Apache Tomcat Native library [1.2.25] using APR version [1.7.0].
03-Aug-2020 19:37:13.222 INFO [main] org.apache.catalina.core.AprLifecycleListener.lifecycleEvent APR capabilities: IPv6 [true], sendfile [true], accept filters [false], random [true].
03-Aug-2020 19:37:13.223 INFO [main] org.apache.catalina.core.AprLifecycleListener.initializeSSL OpenSSL successfully initialized [OpenSSL 3.0.0-alpha6-dev ]
03-Aug-2020 19:37:13.224 INFO [main] org.apache.coyote.AbstractProtocol.init Initializing ProtocolHandler ["http-apr-127.0.0.1-auto-7"]
03-Aug-2020 19:37:13.227 INFO [main] org.apache.catalina.core.StandardService.startInternal Starting service [Tomcat]
03-Aug-2020 19:37:13.228 INFO [main] org.apache.catalina.core.StandardEngine.startInternal Starting Servlet engine: [Apache Tomcat/10.0.0-M8-dev]
03-Aug-2020 19:37:13.257 SEVERE [main] org.apache.catalina.core.StandardContext.startInternal One or more components marked the context as not correctly configured
03-Aug-2020 19:37:13.266 SEVERE [main] org.apache.catalina.core.StandardContext.startInternal Context [/test] startup failed due to previous errors
03-Aug-2020 19:37:13.272 INFO [main] org.apache.coyote.AbstractProtocol.start Starting ProtocolHandler ["http-apr-127.0.0.1-auto-7-46055"]
03-Aug-2020 19:37:13.281 INFO [main] org.apache.coyote.AbstractProtocol.pause Pausing ProtocolHandler ["http-apr-127.0.0.1-auto-7-46055"]
03-Aug-2020 19:37:13.281 INFO [main] org.apache.catalina.core.StandardService.stopInternal Stopping service [Tomcat]
03-Aug-2020 19:37:13.282 INFO [main] org.apache.coyote.AbstractProtocol.stop Stopping ProtocolHandler ["http-apr-127.0.0.1-auto-7-46055"]
03-Aug-2020 19:37:13.337 INFO [main] org.apache.coyote.AbstractProtocol.destroy Destroying ProtocolHandler ["http-apr-127.0.0.1-auto-7-46055"]
03-Aug-2020 19:37:13.345 INFO [main] org.apache.catalina.startup.LoggingBaseTest.setUp Starting test case [testSingleWebapp]
03-Aug-2020 19:37:13.355 INFO [main] org.apache.catalina.core.AprLifecycleListener.lifecycleEvent Loaded Apache Tomcat Native library [1.2.25] using APR version [1.7.0].
03-Aug-2020 19:37:13.358 INFO [main] org.apache.catalina.core.AprLifecycleListener.lifecycleEvent APR capabilities: IPv6 [true], sendfile [true], accept filters [false], random [true].
03-Aug-2020 19:37:13.359 INFO [main] org.apache.catalina.core.AprLifecycleListener.initializeSSL OpenSSL successfully initialized [OpenSSL 3.0.0-alpha6-dev ]
03-Aug-2020 19:37:13.361 INFO [main] org.apache.coyote.AbstractProtocol.init Initializing ProtocolHandler ["http-apr-127.0.0.1-auto-8"]
03-Aug-2020 19:37:13.363 INFO [main] org.apache.catalina.core.StandardService.startInternal Starting service [Tomcat]
03-Aug-2020 19:37:13.363 INFO [main] org.apache.catalina.core.StandardEngine.startInternal Starting Servlet engine: [Apache Tomcat/10.0.0-M8-dev]
03-Aug-2020 19:37:13.478 INFO [main] org.apache.catalina.startup.ContextConfig.getDefaultWebXmlFragment No global web.xml found
03-Aug-2020 19:37:16.245 INFO [main] org.apache.jasper.servlet.TldScanner.scanJars At least one JAR was scanned for TLDs yet contained no TLDs. Enable debug logging for this logger for a complete list of JARs that were scanned but no TLDs were found in them. Skipping unneeded JARs during scanning can improve startup time and JSP compilation time.
03-Aug-2020 19:37:16.407 INFO [main] org.apache.catalina.core.ApplicationContext.log ContextListener: contextInitialized()
03-Aug-2020 19:37:16.407 INFO [main] org.apache.catalina.core.ApplicationContext.log SessionListener: contextInitialized()
03-Aug-2020 19:37:16.412 INFO [main] org.apache.catalina.core.ApplicationContext.log ContextListener: attributeAdded('StockTicker', 'async.Stockticker@26e0d39c')
03-Aug-2020 19:37:16.457 INFO [main] org.apache.coyote.AbstractProtocol.start Starting ProtocolHandler ["http-apr-127.0.0.1-auto-8-37683"]
03-Aug-2020 19:37:16.588 INFO [main] org.apache.coyote.AbstractProtocol.pause Pausing ProtocolHandler ["http-apr-127.0.0.1-auto-8-37683"]
03-Aug-2020 19:37:16.595 INFO [main] org.apache.catalina.core.StandardService.stopInternal Stopping service [Tomcat]
03-Aug-2020 19:37:16.598 INFO [main] org.apache.catalina.core.ApplicationContext.log SessionListener: contextDestroyed()
03-Aug-2020 19:37:16.598 INFO [main] org.apache.catalina.core.ApplicationContext.log ContextListener: contextDestroyed()
03-Aug-2020 19:37:16.613 INFO [main] org.apache.coyote.AbstractProtocol.stop Stopping ProtocolHandler ["http-apr-127.0.0.1-auto-8-37683"]
03-Aug-2020 19:37:16.667 INFO [main] org.apache.coyote.AbstractProtocol.destroy Destroying ProtocolHandler ["http-apr-127.0.0.1-auto-8-37683"]
03-Aug-2020 19:37:16.672 INFO [main] org.apache.catalina.startup.LoggingBaseTest.setUp Starting test case [testBrokenWarOne]
03-Aug-2020 19:37:16.675 INFO [main] org.apache.catalina.core.AprLifecycleListener.lifecycleEvent Loaded Apache Tomcat Native library [1.2.25] using APR version [1.7.0].
03-Aug-2020 19:37:16.675 INFO [main] org.apache.catalina.core.AprLifecycleListener.lifecycleEvent APR capabilities: IPv6 [true], sendfile [true], accept filters [false], random [true].
03-Aug-2020 19:37:16.676 INFO [main] org.apache.catalina.core.AprLifecycleListener.initializeSSL OpenSSL successfully initialized [OpenSSL 3.0.0-alpha6-dev ]
03-Aug-2020 19:37:16.677 INFO [main] org.apache.coyote.AbstractProtocol.init Initializing ProtocolHandler ["http-apr-127.0.0.1-auto-9"]
03-Aug-2020 19:37:16.678 INFO [main] org.apache.catalina.core.StandardService.startInternal Starting service [Tomcat]
03-Aug-2020 19:37:16.678 INFO [main] org.apache.catalina.core.StandardEngine.startInternal Starting Servlet engine: [Apache Tomcat/10.0.0-M8-dev]
03-Aug-2020 19:37:16.686 SEVERE [main] org.apache.catalina.core.ContainerBase.startInternal A child container failed during start
	java.util.concurrent.ExecutionException: org.apache.catalina.LifecycleException: Deliberately Broken
		at java.util.concurrent.FutureTask.report(FutureTask.java:122)
		at java.util.concurrent.FutureTask.get(FutureTask.java:192)
		at org.apache.catalina.core.ContainerBase.startInternal(ContainerBase.java:916)
		at org.apache.catalina.core.StandardHost.startInternal(StandardHost.java:843)
		at org.apache.catalina.util.LifecycleBase.start(LifecycleBase.java:183)
		at org.apache.catalina.core.ContainerBase$StartChild.call(ContainerBase.java:1384)
		at org.apache.catalina.core.ContainerBase$StartChild.call(ContainerBase.java:1374)
		at java.util.concurrent.FutureTask.run(FutureTask.java:266)
		at org.apache.tomcat.util.threads.InlineExecutorService.execute(InlineExecutorService.java:75)
		at java.util.concurrent.AbstractExecutorService.submit(AbstractExecutorService.java:134)
		at org.apache.catalina.core.ContainerBase.startInternal(ContainerBase.java:909)
		at org.apache.catalina.core.StandardEngine.startInternal(StandardEngine.java:262)
		at org.apache.catalina.util.LifecycleBase.start(LifecycleBase.java:183)
		at org.apache.catalina.core.StandardService.startInternal(StandardService.java:421)
		at org.apache.catalina.util.LifecycleBase.start(LifecycleBase.java:183)
		at org.apache.catalina.core.StandardServer.startInternal(StandardServer.java:930)
		at org.apache.catalina.util.LifecycleBase.start(LifecycleBase.java:183)
		at org.apache.catalina.startup.Tomcat.start(Tomcat.java:486)
		at org.apache.catalina.startup.TomcatBaseTest$TomcatWithFastSessionIDs.start(TomcatBaseTest.java:875)
		at org.apache.catalina.startup.TestTomcat.testBrokenWarOne(TestTomcat.java:572)
		at sun.reflect.NativeMethodAccessorImpl.invoke0(Native Method)
		at sun.reflect.NativeMethodAccessorImpl.invoke(NativeMethodAccessorImpl.java:62)
		at sun.reflect.DelegatingMethodAccessorImpl.invoke(DelegatingMethodAccessorImpl.java:43)
		at java.lang.reflect.Method.invoke(Method.java:498)
		at org.junit.runners.model.FrameworkMethod$1.runReflectiveCall(FrameworkMethod.java:59)
		at org.junit.internal.runners.model.ReflectiveCallable.run(ReflectiveCallable.java:12)
		at org.junit.runners.model.FrameworkMethod.invokeExplosively(FrameworkMethod.java:61)
		at org.junit.internal.runners.statements.InvokeMethod.evaluate(InvokeMethod.java:17)
		at org.junit.internal.runners.statements.RunBefores.evaluate(RunBefores.java:26)
		at org.junit.internal.runners.statements.RunAfters.evaluate(RunAfters.java:27)
		at org.junit.rules.TestWatcher$1.evaluate(TestWatcher.java:61)
		at org.junit.runners.ParentRunner$3.evaluate(ParentRunner.java:306)
		at org.junit.runners.BlockJUnit4ClassRunner$1.evaluate(BlockJUnit4ClassRunner.java:100)
		at org.junit.runners.ParentRunner.runLeaf(ParentRunner.java:366)
		at org.junit.runners.BlockJUnit4ClassRunner.runChild(BlockJUnit4ClassRunner.java:103)
		at org.junit.runners.BlockJUnit4ClassRunner.runChild(BlockJUnit4ClassRunner.java:63)
		at org.junit.runners.ParentRunner$4.run(ParentRunner.java:331)
		at org.junit.runners.ParentRunner$1.schedule(ParentRunner.java:79)
		at org.junit.runners.ParentRunner.runChildren(ParentRunner.java:329)
		at org.junit.runners.ParentRunner.access$100(ParentRunner.java:66)
		at org.junit.runners.ParentRunner$2.evaluate(ParentRunner.java:293)
		at org.junit.internal.runners.statements.RunBefores.evaluate(RunBefores.java:26)
		at org.junit.internal.runners.statements.RunAfters.evaluate(RunAfters.java:27)
		at org.junit.runners.ParentRunner$3.evaluate(ParentRunner.java:306)
		at org.junit.runners.ParentRunner.run(ParentRunner.java:413)
		at junit.framework.JUnit4TestAdapter.run(JUnit4TestAdapter.java:50)
		at org.apache.tools.ant.taskdefs.optional.junit.JUnitTestRunner.run(JUnitTestRunner.java:535)
		at org.apache.tools.ant.taskdefs.optional.junit.JUnitTestRunner.launch(JUnitTestRunner.java:1197)
		at org.apache.tools.ant.taskdefs.optional.junit.JUnitTestRunner.main(JUnitTestRunner.java:1042)
	Caused by: org.apache.catalina.LifecycleException: Deliberately Broken
		at org.apache.catalina.startup.TestTomcat$BrokenAuthenticator.startInternal(TestTomcat.java:620)
		at org.apache.catalina.util.LifecycleBase.start(LifecycleBase.java:183)
		at org.apache.catalina.core.StandardPipeline.startInternal(StandardPipeline.java:176)
		at org.apache.catalina.util.LifecycleBase.start(LifecycleBase.java:183)
		at org.apache.catalina.core.StandardContext.startInternal(StandardContext.java:5005)
		at org.apache.catalina.util.LifecycleBase.start(LifecycleBase.java:183)
		at org.apache.catalina.core.ContainerBase$StartChild.call(ContainerBase.java:1384)
		at org.apache.catalina.core.ContainerBase$StartChild.call(ContainerBase.java:1374)
		at java.util.concurrent.FutureTask.run(FutureTask.java:266)
		at org.apache.tomcat.util.threads.InlineExecutorService.execute(InlineExecutorService.java:75)
		at java.util.concurrent.AbstractExecutorService.submit(AbstractExecutorService.java:134)
		at org.apache.catalina.core.ContainerBase.startInternal(ContainerBase.java:909)
		... 46 more
03-Aug-2020 19:37:16.692 SEVERE [main] org.apache.catalina.core.ContainerBase.startInternal A child container failed during start
	java.util.concurrent.ExecutionException: org.apache.catalina.LifecycleException: A child container failed during start
		at java.util.concurrent.FutureTask.report(FutureTask.java:122)
		at java.util.concurrent.FutureTask.get(FutureTask.java:192)
		at org.apache.catalina.core.ContainerBase.startInternal(ContainerBase.java:916)
		at org.apache.catalina.core.StandardEngine.startInternal(StandardEngine.java:262)
		at org.apache.catalina.util.LifecycleBase.start(LifecycleBase.java:183)
		at org.apache.catalina.core.StandardService.startInternal(StandardService.java:421)
		at org.apache.catalina.util.LifecycleBase.start(LifecycleBase.java:183)
		at org.apache.catalina.core.StandardServer.startInternal(StandardServer.java:930)
		at org.apache.catalina.util.LifecycleBase.start(LifecycleBase.java:183)
		at org.apache.catalina.startup.Tomcat.start(Tomcat.java:486)
		at org.apache.catalina.startup.TomcatBaseTest$TomcatWithFastSessionIDs.start(TomcatBaseTest.java:875)
		at org.apache.catalina.startup.TestTomcat.testBrokenWarOne(TestTomcat.java:572)
		at sun.reflect.NativeMethodAccessorImpl.invoke0(Native Method)
		at sun.reflect.NativeMethodAccessorImpl.invoke(NativeMethodAccessorImpl.java:62)
		at sun.reflect.DelegatingMethodAccessorImpl.invoke(DelegatingMethodAccessorImpl.java:43)
		at java.lang.reflect.Method.invoke(Method.java:498)
		at org.junit.runners.model.FrameworkMethod$1.runReflectiveCall(FrameworkMethod.java:59)
		at org.junit.internal.runners.model.ReflectiveCallable.run(ReflectiveCallable.java:12)
		at org.junit.runners.model.FrameworkMethod.invokeExplosively(FrameworkMethod.java:61)
		at org.junit.internal.runners.statements.InvokeMethod.evaluate(InvokeMethod.java:17)
		at org.junit.internal.runners.statements.RunBefores.evaluate(RunBefores.java:26)
		at org.junit.internal.runners.statements.RunAfters.evaluate(RunAfters.java:27)
		at org.junit.rules.TestWatcher$1.evaluate(TestWatcher.java:61)
		at org.junit.runners.ParentRunner$3.evaluate(ParentRunner.java:306)
		at org.junit.runners.BlockJUnit4ClassRunner$1.evaluate(BlockJUnit4ClassRunner.java:100)
		at org.junit.runners.ParentRunner.runLeaf(ParentRunner.java:366)
		at org.junit.runners.BlockJUnit4ClassRunner.runChild(BlockJUnit4ClassRunner.java:103)
		at org.junit.runners.BlockJUnit4ClassRunner.runChild(BlockJUnit4ClassRunner.java:63)
		at org.junit.runners.ParentRunner$4.run(ParentRunner.java:331)
		at org.junit.runners.ParentRunner$1.schedule(ParentRunner.java:79)
		at org.junit.runners.ParentRunner.runChildren(ParentRunner.java:329)
		at org.junit.runners.ParentRunner.access$100(ParentRunner.java:66)
		at org.junit.runners.ParentRunner$2.evaluate(ParentRunner.java:293)
		at org.junit.internal.runners.statements.RunBefores.evaluate(RunBefores.java:26)
		at org.junit.internal.runners.statements.RunAfters.evaluate(RunAfters.java:27)
		at org.junit.runners.ParentRunner$3.evaluate(ParentRunner.java:306)
		at org.junit.runners.ParentRunner.run(ParentRunner.java:413)
		at junit.framework.JUnit4TestAdapter.run(JUnit4TestAdapter.java:50)
		at org.apache.tools.ant.taskdefs.optional.junit.JUnitTestRunner.run(JUnitTestRunner.java:535)
		at org.apache.tools.ant.taskdefs.optional.junit.JUnitTestRunner.launch(JUnitTestRunner.java:1197)
		at org.apache.tools.ant.taskdefs.optional.junit.JUnitTestRunner.main(JUnitTestRunner.java:1042)
	Caused by: org.apache.catalina.LifecycleException: A child container failed during start
		at org.apache.catalina.core.ContainerBase.startInternal(ContainerBase.java:928)
		at org.apache.catalina.core.StandardHost.startInternal(StandardHost.java:843)
		at org.apache.catalina.util.LifecycleBase.start(LifecycleBase.java:183)
		at org.apache.catalina.core.ContainerBase$StartChild.call(ContainerBase.java:1384)
		at org.apache.catalina.core.ContainerBase$StartChild.call(ContainerBase.java:1374)
		at java.util.concurrent.FutureTask.run(FutureTask.java:266)
		at org.apache.tomcat.util.threads.InlineExecutorService.execute(InlineExecutorService.java:75)
		at java.util.concurrent.AbstractExecutorService.submit(AbstractExecutorService.java:134)
		at org.apache.catalina.core.ContainerBase.startInternal(ContainerBase.java:909)
		... 38 more
	Caused by: java.util.concurrent.ExecutionException: org.apache.catalina.LifecycleException: Deliberately Broken
		at java.util.concurrent.FutureTask.report(FutureTask.java:122)
		at java.util.concurrent.FutureTask.get(FutureTask.java:192)
		at org.apache.catalina.core.ContainerBase.startInternal(ContainerBase.java:916)
		... 46 more
	Caused by: org.apache.catalina.LifecycleException: Deliberately Broken
		at org.apache.catalina.startup.TestTomcat$BrokenAuthenticator.startInternal(TestTomcat.java:620)
		at org.apache.catalina.util.LifecycleBase.start(LifecycleBase.java:183)
		at org.apache.catalina.core.StandardPipeline.startInternal(StandardPipeline.java:176)
		at org.apache.catalina.util.LifecycleBase.start(LifecycleBase.java:183)
		at org.apache.catalina.core.StandardContext.startInternal(StandardContext.java:5005)
		at org.apache.catalina.util.LifecycleBase.start(LifecycleBase.java:183)
		at org.apache.catalina.core.ContainerBase$StartChild.call(ContainerBase.java:1384)
		at org.apache.catalina.core.ContainerBase$StartChild.call(ContainerBase.java:1374)
		at java.util.concurrent.FutureTask.run(FutureTask.java:266)
		at org.apache.tomcat.util.threads.InlineExecutorService.execute(InlineExecutorService.java:75)

Continuation...

		at java.util.concurrent.AbstractExecutorService.submit(AbstractExecutorService.java:134)
		at org.apache.catalina.core.ContainerBase.startInternal(ContainerBase.java:909)
		... 46 more
03-Aug-2020 19:37:16.699 INFO [main] org.apache.coyote.AbstractProtocol.pause Pausing ProtocolHandler ["http-apr-127.0.0.1-auto-9-34637"]
03-Aug-2020 19:37:16.699 INFO [main] org.apache.catalina.core.StandardService.stopInternal Stopping service [Tomcat]
03-Aug-2020 19:37:16.700 INFO [main] org.apache.coyote.AbstractProtocol.destroy Destroying ProtocolHandler ["http-apr-127.0.0.1-auto-9-34637"]
03-Aug-2020 19:37:16.704 INFO [main] org.apache.catalina.startup.LoggingBaseTest.setUp Starting test case [testBrokenWarTwo]
03-Aug-2020 19:37:16.706 INFO [main] org.apache.catalina.core.AprLifecycleListener.lifecycleEvent Loaded Apache Tomcat Native library [1.2.25] using APR version [1.7.0].
03-Aug-2020 19:37:16.706 INFO [main] org.apache.catalina.core.AprLifecycleListener.lifecycleEvent APR capabilities: IPv6 [true], sendfile [true], accept filters [false], random [true].
03-Aug-2020 19:37:16.706 INFO [main] org.apache.catalina.core.AprLifecycleListener.initializeSSL OpenSSL successfully initialized [OpenSSL 3.0.0-alpha6-dev ]
03-Aug-2020 19:37:16.707 INFO [main] org.apache.coyote.AbstractProtocol.init Initializing ProtocolHandler ["http-apr-127.0.0.1-auto-10"]
03-Aug-2020 19:37:16.708 INFO [main] org.apache.catalina.core.StandardService.startInternal Starting service [Tomcat]
03-Aug-2020 19:37:16.709 INFO [main] org.apache.catalina.core.StandardEngine.startInternal Starting Servlet engine: [Apache Tomcat/10.0.0-M8-dev]
03-Aug-2020 19:37:16.715 SEVERE [main] org.apache.catalina.core.ContainerBase.startInternal A child container failed during start
	java.util.concurrent.ExecutionException: org.apache.catalina.LifecycleException: Deliberately Broken
		at java.util.concurrent.FutureTask.report(FutureTask.java:122)
		at java.util.concurrent.FutureTask.get(FutureTask.java:192)
		at org.apache.catalina.core.ContainerBase.startInternal(ContainerBase.java:916)
		at org.apache.catalina.core.StandardHost.startInternal(StandardHost.java:843)
		at org.apache.catalina.util.LifecycleBase.start(LifecycleBase.java:183)
		at org.apache.catalina.core.ContainerBase$StartChild.call(ContainerBase.java:1384)
		at org.apache.catalina.core.ContainerBase$StartChild.call(ContainerBase.java:1374)
		at java.util.concurrent.FutureTask.run(FutureTask.java:266)
		at org.apache.tomcat.util.threads.InlineExecutorService.execute(InlineExecutorService.java:75)
		at java.util.concurrent.AbstractExecutorService.submit(AbstractExecutorService.java:134)
		at org.apache.catalina.core.ContainerBase.startInternal(ContainerBase.java:909)
		at org.apache.catalina.core.StandardEngine.startInternal(StandardEngine.java:262)
		at org.apache.catalina.util.LifecycleBase.start(LifecycleBase.java:183)
		at org.apache.catalina.core.StandardService.startInternal(StandardService.java:421)
		at org.apache.catalina.util.LifecycleBase.start(LifecycleBase.java:183)
		at org.apache.catalina.core.StandardServer.startInternal(StandardServer.java:930)
		at org.apache.catalina.util.LifecycleBase.start(LifecycleBase.java:183)
		at org.apache.catalina.startup.Tomcat.start(Tomcat.java:486)
		at org.apache.catalina.startup.TomcatBaseTest$TomcatWithFastSessionIDs.start(TomcatBaseTest.java:875)
		at org.apache.catalina.startup.TestTomcat.testBrokenWarTwo(TestTomcat.java:590)
		at sun.reflect.NativeMethodAccessorImpl.invoke0(Native Method)
		at sun.reflect.NativeMethodAccessorImpl.invoke(NativeMethodAccessorImpl.java:62)
		at sun.reflect.DelegatingMethodAccessorImpl.invoke(DelegatingMethodAccessorImpl.java:43)
		at java.lang.reflect.Method.invoke(Method.java:498)
		at org.junit.runners.model.FrameworkMethod$1.runReflectiveCall(FrameworkMethod.java:59)
		at org.junit.internal.runners.model.ReflectiveCallable.run(ReflectiveCallable.java:12)
		at org.junit.runners.model.FrameworkMethod.invokeExplosively(FrameworkMethod.java:61)
		at org.junit.internal.runners.statements.InvokeMethod.evaluate(InvokeMethod.java:17)
		at org.junit.internal.runners.statements.RunBefores.evaluate(RunBefores.java:26)
		at org.junit.internal.runners.statements.RunAfters.evaluate(RunAfters.java:27)
		at org.junit.rules.TestWatcher$1.evaluate(TestWatcher.java:61)
		at org.junit.runners.ParentRunner$3.evaluate(ParentRunner.java:306)
		at org.junit.runners.BlockJUnit4ClassRunner$1.evaluate(BlockJUnit4ClassRunner.java:100)
		at org.junit.runners.ParentRunner.runLeaf(ParentRunner.java:366)
		at org.junit.runners.BlockJUnit4ClassRunner.runChild(BlockJUnit4ClassRunner.java:103)
		at org.junit.runners.BlockJUnit4ClassRunner.runChild(BlockJUnit4ClassRunner.java:63)
		at org.junit.runners.ParentRunner$4.run(ParentRunner.java:331)
		at org.junit.runners.ParentRunner$1.schedule(ParentRunner.java:79)
		at org.junit.runners.ParentRunner.runChildren(ParentRunner.java:329)
		at org.junit.runners.ParentRunner.access$100(ParentRunner.java:66)
		at org.junit.runners.ParentRunner$2.evaluate(ParentRunner.java:293)
		at org.junit.internal.runners.statements.RunBefores.evaluate(RunBefores.java:26)
		at org.junit.internal.runners.statements.RunAfters.evaluate(RunAfters.java:27)
		at org.junit.runners.ParentRunner$3.evaluate(ParentRunner.java:306)
		at org.junit.runners.ParentRunner.run(ParentRunner.java:413)
		at junit.framework.JUnit4TestAdapter.run(JUnit4TestAdapter.java:50)
		at org.apache.tools.ant.taskdefs.optional.junit.JUnitTestRunner.run(JUnitTestRunner.java:535)
		at org.apache.tools.ant.taskdefs.optional.junit.JUnitTestRunner.launch(JUnitTestRunner.java:1197)
		at org.apache.tools.ant.taskdefs.optional.junit.JUnitTestRunner.main(JUnitTestRunner.java:1042)
	Caused by: org.apache.catalina.LifecycleException: Deliberately Broken
		at org.apache.catalina.startup.TestTomcat$BrokenAuthenticator.startInternal(TestTomcat.java:620)
		at org.apache.catalina.util.LifecycleBase.start(LifecycleBase.java:183)
		at org.apache.catalina.core.StandardPipeline.startInternal(StandardPipeline.java:176)
		at org.apache.catalina.util.LifecycleBase.start(LifecycleBase.java:183)
		at org.apache.catalina.core.StandardContext.startInternal(StandardContext.java:5005)
		at org.apache.catalina.util.LifecycleBase.start(LifecycleBase.java:183)
		at org.apache.catalina.core.ContainerBase$StartChild.call(ContainerBase.java:1384)
		at org.apache.catalina.core.ContainerBase$StartChild.call(ContainerBase.java:1374)
		at java.util.concurrent.FutureTask.run(FutureTask.java:266)
		at org.apache.tomcat.util.threads.InlineExecutorService.execute(InlineExecutorService.java:75)
		at java.util.concurrent.AbstractExecutorService.submit(AbstractExecutorService.java:134)
		at org.apache.catalina.core.ContainerBase.startInternal(ContainerBase.java:909)
		... 46 more
03-Aug-2020 19:37:16.717 SEVERE [main] org.apache.catalina.core.ContainerBase.startInternal A child container failed during start
	java.util.concurrent.ExecutionException: org.apache.catalina.LifecycleException: Deliberately Broken
		at java.util.concurrent.FutureTask.report(FutureTask.java:122)
		at java.util.concurrent.FutureTask.get(FutureTask.java:192)
		at org.apache.catalina.core.ContainerBase.startInternal(ContainerBase.java:916)
		at org.apache.catalina.core.StandardHost.startInternal(StandardHost.java:843)
		at org.apache.catalina.util.LifecycleBase.start(LifecycleBase.java:183)
		at org.apache.catalina.core.ContainerBase$StartChild.call(ContainerBase.java:1384)
		at org.apache.catalina.core.ContainerBase$StartChild.call(ContainerBase.java:1374)
		at java.util.concurrent.FutureTask.run(FutureTask.java:266)
		at org.apache.tomcat.util.threads.InlineExecutorService.execute(InlineExecutorService.java:75)
		at java.util.concurrent.AbstractExecutorService.submit(AbstractExecutorService.java:134)
		at org.apache.catalina.core.ContainerBase.startInternal(ContainerBase.java:909)
		at org.apache.catalina.core.StandardEngine.startInternal(StandardEngine.java:262)
		at org.apache.catalina.util.LifecycleBase.start(LifecycleBase.java:183)
		at org.apache.catalina.core.StandardService.startInternal(StandardService.java:421)
		at org.apache.catalina.util.LifecycleBase.start(LifecycleBase.java:183)
		at org.apache.catalina.core.StandardServer.startInternal(StandardServer.java:930)
		at org.apache.catalina.util.LifecycleBase.start(LifecycleBase.java:183)
		at org.apache.catalina.startup.Tomcat.start(Tomcat.java:486)
		at org.apache.catalina.startup.TomcatBaseTest$TomcatWithFastSessionIDs.start(TomcatBaseTest.java:875)
		at org.apache.catalina.startup.TestTomcat.testBrokenWarTwo(TestTomcat.java:590)
		at sun.reflect.NativeMethodAccessorImpl.invoke0(Native Method)
		at sun.reflect.NativeMethodAccessorImpl.invoke(NativeMethodAccessorImpl.java:62)
		at sun.reflect.DelegatingMethodAccessorImpl.invoke(DelegatingMethodAccessorImpl.java:43)
		at java.lang.reflect.Method.invoke(Method.java:498)
		at org.junit.runners.model.FrameworkMethod$1.runReflectiveCall(FrameworkMethod.java:59)
		at org.junit.internal.runners.model.ReflectiveCallable.run(ReflectiveCallable.java:12)
		at org.junit.runners.model.FrameworkMethod.invokeExplosively(FrameworkMethod.java:61)
		at org.junit.internal.runners.statements.InvokeMethod.evaluate(InvokeMethod.java:17)
		at org.junit.internal.runners.statements.RunBefores.evaluate(RunBefores.java:26)
		at org.junit.internal.runners.statements.RunAfters.evaluate(RunAfters.java:27)
		at org.junit.rules.TestWatcher$1.evaluate(TestWatcher.java:61)
		at org.junit.runners.ParentRunner$3.evaluate(ParentRunner.java:306)
		at org.junit.runners.BlockJUnit4ClassRunner$1.evaluate(BlockJUnit4ClassRunner.java:100)
		at org.junit.runners.ParentRunner.runLeaf(ParentRunner.java:366)
		at org.junit.runners.BlockJUnit4ClassRunner.runChild(BlockJUnit4ClassRunner.java:103)
		at org.junit.runners.BlockJUnit4ClassRunner.runChild(BlockJUnit4ClassRunner.java:63)
		at org.junit.runners.ParentRunner$4.run(ParentRunner.java:331)
		at org.junit.runners.ParentRunner$1.schedule(ParentRunner.java:79)
		at org.junit.runners.ParentRunner.runChildren(ParentRunner.java:329)
		at org.junit.runners.ParentRunner.access$100(ParentRunner.java:66)
		at org.junit.runners.ParentRunner$2.evaluate(ParentRunner.java:293)
		at org.junit.internal.runners.statements.RunBefores.evaluate(RunBefores.java:26)
		at org.junit.internal.runners.statements.RunAfters.evaluate(RunAfters.java:27)
		at org.junit.runners.ParentRunner$3.evaluate(ParentRunner.java:306)
		at org.junit.runners.ParentRunner.run(ParentRunner.java:413)
		at junit.framework.JUnit4TestAdapter.run(JUnit4TestAdapter.java:50)
		at org.apache.tools.ant.taskdefs.optional.junit.JUnitTestRunner.run(JUnitTestRunner.java:535)
		at org.apache.tools.ant.taskdefs.optional.junit.JUnitTestRunner.launch(JUnitTestRunner.java:1197)
		at org.apache.tools.ant.taskdefs.optional.junit.JUnitTestRunner.main(JUnitTestRunner.java:1042)
	Caused by: org.apache.catalina.LifecycleException: Deliberately Broken
		at org.apache.catalina.startup.TestTomcat$BrokenAuthenticator.startInternal(TestTomcat.java:620)
		at org.apache.catalina.util.LifecycleBase.start(LifecycleBase.java:183)
		at org.apache.catalina.core.StandardPipeline.startInternal(StandardPipeline.java:176)
		at org.apache.catalina.util.LifecycleBase.start(LifecycleBase.java:183)
		at org.apache.catalina.core.StandardContext.startInternal(StandardContext.java:5005)
		at org.apache.catalina.util.LifecycleBase.start(LifecycleBase.java:183)
		at org.apache.catalina.core.ContainerBase$StartChild.call(ContainerBase.java:1384)
		at org.apache.catalina.core.ContainerBase$StartChild.call(ContainerBase.java:1374)
		at java.util.concurrent.FutureTask.run(FutureTask.java:266)
		at org.apache.tomcat.util.threads.InlineExecutorService.execute(InlineExecutorService.java:75)
		at java.util.concurrent.AbstractExecutorService.submit(AbstractExecutorService.java:134)
		at org.apache.catalina.core.ContainerBase.startInternal(ContainerBase.java:909)
		... 46 more
03-Aug-2020 19:37:16.718 SEVERE [main] org.apache.catalina.core.ContainerBase.startInternal A child container failed during start
	java.util.concurrent.ExecutionException: org.apache.catalina.LifecycleException: A child container failed during start
		at java.util.concurrent.FutureTask.report(FutureTask.java:122)
		at java.util.concurrent.FutureTask.get(FutureTask.java:192)
		at org.apache.catalina.core.ContainerBase.startInternal(ContainerBase.java:916)
		at org.apache.catalina.core.StandardEngine.startInternal(StandardEngine.java:262)
		at org.apache.catalina.util.LifecycleBase.start(LifecycleBase.java:183)
		at org.apache.catalina.core.StandardService.startInternal(StandardService.java:421)
		at org.apache.catalina.util.LifecycleBase.start(LifecycleBase.java:183)
		at org.apache.catalina.core.StandardServer.startInternal(StandardServer.java:930)
		at org.apache.catalina.util.LifecycleBase.start(LifecycleBase.java:183)
		at org.apache.catalina.startup.Tomcat.start(Tomcat.java:486)
		at org.apache.catalina.startup.TomcatBaseTest$TomcatWithFastSessionIDs.start(TomcatBaseTest.java:875)
		at org.apache.catalina.startup.TestTomcat.testBrokenWarTwo(TestTomcat.java:590)
		at sun.reflect.NativeMethodAccessorImpl.invoke0(Native Method)
		at sun.reflect.NativeMethodAccessorImpl.invoke(NativeMethodAccessorImpl.java:62)
		at sun.reflect.DelegatingMethodAccessorImpl.invoke(DelegatingMethodAccessorImpl.java:43)
		at java.lang.reflect.Method.invoke(Method.java:498)
		at org.junit.runners.model.FrameworkMethod$1.runReflectiveCall(FrameworkMethod.java:59)
		at org.junit.internal.runners.model.ReflectiveCallable.run(ReflectiveCallable.java:12)
		at org.junit.runners.model.FrameworkMethod.invokeExplosively(FrameworkMethod.java:61)
		at org.junit.internal.runners.statements.InvokeMethod.evaluate(InvokeMethod.java:17)
		at org.junit.internal.runners.statements.RunBefores.evaluate(RunBefores.java:26)
		at org.junit.internal.runners.statements.RunAfters.evaluate(RunAfters.java:27)
		at org.junit.rules.TestWatcher$1.evaluate(TestWatcher.java:61)
		at org.junit.runners.ParentRunner$3.evaluate(ParentRunner.java:306)
		at org.junit.runners.BlockJUnit4ClassRunner$1.evaluate(BlockJUnit4ClassRunner.java:100)
		at org.junit.runners.ParentRunner.runLeaf(ParentRunner.java:366)
		at org.junit.runners.BlockJUnit4ClassRunner.runChild(BlockJUnit4ClassRunner.java:103)
		at org.junit.runners.BlockJUnit4ClassRunner.runChild(BlockJUnit4ClassRunner.java:63)
		at org.junit.runners.ParentRunner$4.run(ParentRunner.java:331)
		at org.junit.runners.ParentRunner$1.schedule(ParentRunner.java:79)
		at org.junit.runners.ParentRunner.runChildren(ParentRunner.java:329)
		at org.junit.runners.ParentRunner.access$100(ParentRunner.java:66)
		at org.junit.runners.ParentRunner$2.evaluate(ParentRunner.java:293)
		at org.junit.internal.runners.statements.RunBefores.evaluate(RunBefores.java:26)
		at org.junit.internal.runners.statements.RunAfters.evaluate(RunAfters.java:27)
		at org.junit.runners.ParentRunner$3.evaluate(ParentRunner.java:306)
		at org.junit.runners.ParentRunner.run(ParentRunner.java:413)
		at junit.framework.JUnit4TestAdapter.run(JUnit4TestAdapter.java:50)
		at org.apache.tools.ant.taskdefs.optional.junit.JUnitTestRunner.run(JUnitTestRunner.java:535)
		at org.apache.tools.ant.taskdefs.optional.junit.JUnitTestRunner.launch(JUnitTestRunner.java:1197)
		at org.apache.tools.ant.taskdefs.optional.junit.JUnitTestRunner.main(JUnitTestRunner.java:1042)
	Caused by: org.apache.catalina.LifecycleException: A child container failed during start
		at org.apache.catalina.core.ContainerBase.startInternal(ContainerBase.java:928)
		at org.apache.catalina.core.StandardHost.startInternal(StandardHost.java:843)
		at org.apache.catalina.util.LifecycleBase.start(LifecycleBase.java:183)
		at org.apache.catalina.core.ContainerBase$StartChild.call(ContainerBase.java:1384)
		at org.apache.catalina.core.ContainerBase$StartChild.call(ContainerBase.java:1374)
		at java.util.concurrent.FutureTask.run(FutureTask.java:266)
		at org.apache.tomcat.util.threads.InlineExecutorService.execute(InlineExecutorService.java:75)
		at java.util.concurrent.AbstractExecutorService.submit(AbstractExecutorService.java:134)
		at org.apache.catalina.core.ContainerBase.startInternal(ContainerBase.java:909)
		... 38 more
	Caused by: org.apache.tomcat.util.MultiThrowable: 2 wrapped Throwables: [org.apache.catalina.LifecycleException: Deliberately Broken][org.apache.catalina.LifecycleException: Deliberately Broken]
		at org.apache.catalina.core.ContainerBase.startInternal(ContainerBase.java:920)
		... 46 more
03-Aug-2020 19:37:16.720 INFO [main] org.apache.coyote.AbstractProtocol.pause Pausing ProtocolHandler ["http-apr-127.0.0.1-auto-10-43691"]
03-Aug-2020 19:37:16.720 INFO [main] org.apache.catalina.core.StandardService.stopInternal Stopping service [Tomcat]
03-Aug-2020 19:37:16.720 INFO [main] org.apache.coyote.AbstractProtocol.destroy Destroying ProtocolHandler ["http-apr-127.0.0.1-auto-10-43691"]
03-Aug-2020 19:37:16.734 INFO [main] org.apache.catalina.startup.LoggingBaseTest.setUp Starting test case [testJsps]
03-Aug-2020 19:37:16.736 INFO [main] org.apache.catalina.core.AprLifecycleListener.lifecycleEvent Loaded Apache Tomcat Native library [1.2.25] using APR version [1.7.0].
03-Aug-2020 19:37:16.736 INFO [main] org.apache.catalina.core.AprLifecycleListener.lifecycleEvent APR capabilities: IPv6 [true], sendfile [true], accept filters [false], random [true].
03-Aug-2020 19:37:16.736 INFO [main] org.apache.catalina.core.AprLifecycleListener.initializeSSL OpenSSL successfully initialized [OpenSSL 3.0.0-alpha6-dev ]
03-Aug-2020 19:37:16.738 INFO [main] org.apache.coyote.AbstractProtocol.init Initializing ProtocolHandler ["http-apr-127.0.0.1-auto-11"]
03-Aug-2020 19:37:16.738 INFO [main] org.apache.catalina.core.StandardService.startInternal Starting service [Tomcat]
03-Aug-2020 19:37:16.746 INFO [main] org.apache.catalina.core.StandardEngine.startInternal Starting Servlet engine: [Apache Tomcat/10.0.0-M8-dev]
03-Aug-2020 19:37:16.773 INFO [main] org.apache.catalina.startup.ContextConfig.getDefaultWebXmlFragment No global web.xml found
03-Aug-2020 19:37:18.769 INFO [main] org.apache.jasper.servlet.TldScanner.scanJars At least one JAR was scanned for TLDs yet contained no TLDs. Enable debug logging for this logger for a complete list of JARs that were scanned but no TLDs were found in them. Skipping unneeded JARs during scanning can improve startup time and JSP compilation time.
03-Aug-2020 19:37:18.821 INFO [main] org.apache.catalina.core.ApplicationContext.log ContextListener: contextInitialized()
03-Aug-2020 19:37:18.821 INFO [main] org.apache.catalina.core.ApplicationContext.log SessionListener: contextInitialized()
03-Aug-2020 19:37:18.823 INFO [main] org.apache.catalina.core.ApplicationContext.log ContextListener: attributeAdded('StockTicker', 'async.Stockticker@5192b301')
03-Aug-2020 19:37:18.837 INFO [main] org.apache.coyote.AbstractProtocol.start Starting ProtocolHandler ["http-apr-127.0.0.1-auto-11-43257"]
03-Aug-2020 19:37:18.992 INFO [http-apr-127.0.0.1-auto-11-exec-1] org.apache.catalina.core.ApplicationContext.log ContextListener: attributeAdded('org.apache.jasper.runtime.JspApplicationContextImpl', 'org.apache.jasper.runtime.JspApplicationContextImpl@3d5657a1')
03-Aug-2020 19:37:19.102 INFO [http-apr-127.0.0.1-auto-11-exec-1] org.apache.catalina.core.ApplicationContext.log ContextListener: attributeAdded('org.apache.jasper.compiler.ELInterpreter', 'org.apache.jasper.compiler.ELInterpreterFactory$DefaultELInterpreter@2b4b2ac8')
03-Aug-2020 19:37:20.700 INFO [http-apr-127.0.0.1-auto-11-exec-1] org.apache.catalina.core.ApplicationContext.log SessionListener: sessionCreated('343A006E8A4CBDB10831774CA97B8388')
03-Aug-2020 19:37:20.726 INFO [main] org.apache.coyote.AbstractProtocol.pause Pausing ProtocolHandler ["http-apr-127.0.0.1-auto-11-43257"]

Continuation...

03-Aug-2020 19:37:20.733 INFO [main] org.apache.catalina.core.StandardService.stopInternal Stopping service [Tomcat]
03-Aug-2020 19:37:20.737 INFO [main] org.apache.catalina.core.ApplicationContext.log SessionListener: sessionDestroyed('343A006E8A4CBDB10831774CA97B8388')
03-Aug-2020 19:37:20.738 INFO [main] org.apache.catalina.core.ApplicationContext.log SessionListener: contextDestroyed()
03-Aug-2020 19:37:20.738 INFO [main] org.apache.catalina.core.ApplicationContext.log ContextListener: contextDestroyed()
03-Aug-2020 19:37:20.750 INFO [main] org.apache.coyote.AbstractProtocol.stop Stopping ProtocolHandler ["http-apr-127.0.0.1-auto-11-43257"]
03-Aug-2020 19:37:20.805 INFO [main] org.apache.coyote.AbstractProtocol.destroy Destroying ProtocolHandler ["http-apr-127.0.0.1-auto-11-43257"]
03-Aug-2020 19:37:20.815 INFO [main] org.apache.catalina.startup.LoggingBaseTest.setUp Starting test case [testGetWebappConfigFileFromDirectory]
03-Aug-2020 19:37:20.816 INFO [main] org.apache.coyote.AbstractProtocol.destroy Destroying ProtocolHandler ["http-apr-127.0.0.1-auto-12"]
03-Aug-2020 19:37:20.817 INFO [main] org.apache.catalina.startup.LoggingBaseTest.setUp Starting test case [testBug50826]
03-Aug-2020 19:37:20.823 INFO [main] org.apache.coyote.AbstractProtocol.destroy Destroying ProtocolHandler ["http-apr-127.0.0.1-auto-13"]
03-Aug-2020 19:37:20.825 INFO [main] org.apache.catalina.startup.LoggingBaseTest.setUp Starting test case [testBug51526]
03-Aug-2020 19:37:20.827 INFO [main] org.apache.catalina.core.AprLifecycleListener.lifecycleEvent Loaded Apache Tomcat Native library [1.2.25] using APR version [1.7.0].
03-Aug-2020 19:37:20.828 INFO [main] org.apache.catalina.core.AprLifecycleListener.lifecycleEvent APR capabilities: IPv6 [true], sendfile [true], accept filters [false], random [true].
03-Aug-2020 19:37:20.828 INFO [main] org.apache.catalina.core.AprLifecycleListener.initializeSSL OpenSSL successfully initialized [OpenSSL 3.0.0-alpha6-dev ]
03-Aug-2020 19:37:20.831 INFO [main] org.apache.coyote.AbstractProtocol.init Initializing ProtocolHandler ["http-apr-127.0.0.1-auto-14"]
03-Aug-2020 19:37:20.839 INFO [main] org.apache.catalina.core.StandardService.startInternal Starting service [Tomcat]
03-Aug-2020 19:37:20.840 INFO [main] org.apache.catalina.core.StandardEngine.startInternal Starting Servlet engine: [Apache Tomcat/10.0.0-M8-dev]
03-Aug-2020 19:37:20.884 INFO [main] org.apache.catalina.startup.ContextConfig.getDefaultWebXmlFragment No global web.xml found
03-Aug-2020 19:37:22.868 INFO [main] org.apache.jasper.servlet.TldScanner.scanJars At least one JAR was scanned for TLDs yet contained no TLDs. Enable debug logging for this logger for a complete list of JARs that were scanned but no TLDs were found in them. Skipping unneeded JARs during scanning can improve startup time and JSP compilation time.
03-Aug-2020 19:37:22.886 INFO [main] org.apache.coyote.AbstractProtocol.start Starting ProtocolHandler ["http-apr-127.0.0.1-auto-14-34955"]
03-Aug-2020 19:37:22.894 INFO [main] org.apache.coyote.AbstractProtocol.pause Pausing ProtocolHandler ["http-apr-127.0.0.1-auto-14-34955"]
03-Aug-2020 19:37:22.894 INFO [main] org.apache.catalina.core.StandardService.stopInternal Stopping service [Tomcat]
03-Aug-2020 19:37:22.897 INFO [main] org.apache.coyote.AbstractProtocol.stop Stopping ProtocolHandler ["http-apr-127.0.0.1-auto-14-34955"]
03-Aug-2020 19:37:22.954 INFO [main] org.apache.coyote.AbstractProtocol.destroy Destroying ProtocolHandler ["http-apr-127.0.0.1-auto-14-34955"]
03-Aug-2020 19:37:22.962 INFO [main] org.apache.catalina.startup.LoggingBaseTest.setUp Starting test case [testBug53301]
03-Aug-2020 19:37:22.964 INFO [main] org.apache.catalina.core.AprLifecycleListener.lifecycleEvent Loaded Apache Tomcat Native library [1.2.25] using APR version [1.7.0].
03-Aug-2020 19:37:22.965 INFO [main] org.apache.catalina.core.AprLifecycleListener.lifecycleEvent APR capabilities: IPv6 [true], sendfile [true], accept filters [false], random [true].
03-Aug-2020 19:37:22.965 INFO [main] org.apache.catalina.core.AprLifecycleListener.initializeSSL OpenSSL successfully initialized [OpenSSL 3.0.0-alpha6-dev ]
03-Aug-2020 19:37:22.966 INFO [main] org.apache.coyote.AbstractProtocol.init Initializing ProtocolHandler ["http-apr-127.0.0.1-auto-15"]
03-Aug-2020 19:37:22.975 INFO [main] org.apache.catalina.core.StandardService.startInternal Starting service [Tomcat]
03-Aug-2020 19:37:22.976 INFO [main] org.apache.catalina.core.StandardEngine.startInternal Starting Servlet engine: [Apache Tomcat/10.0.0-M8-dev]
03-Aug-2020 19:37:22.987 INFO [main] org.apache.coyote.AbstractProtocol.start Starting ProtocolHandler ["http-apr-127.0.0.1-auto-15-33759"]
03-Aug-2020 19:37:23.003 INFO [main] org.apache.coyote.AbstractProtocol.pause Pausing ProtocolHandler ["http-apr-127.0.0.1-auto-15-33759"]
03-Aug-2020 19:37:23.010 INFO [main] org.apache.catalina.core.StandardService.stopInternal Stopping service [Tomcat]
03-Aug-2020 19:37:23.013 INFO [main] org.apache.coyote.AbstractProtocol.stop Stopping ProtocolHandler ["http-apr-127.0.0.1-auto-15-33759"]
03-Aug-2020 19:37:23.068 INFO [main] org.apache.coyote.AbstractProtocol.destroy Destroying ProtocolHandler ["http-apr-127.0.0.1-auto-15-33759"]
03-Aug-2020 19:37:23.073 INFO [main] org.apache.catalina.startup.LoggingBaseTest.setUp Starting test case [testEnableNaming]
03-Aug-2020 19:37:23.105 INFO [main] org.apache.catalina.core.AprLifecycleListener.lifecycleEvent Loaded Apache Tomcat Native library [1.2.25] using APR version [1.7.0].
03-Aug-2020 19:37:23.105 INFO [main] org.apache.catalina.core.AprLifecycleListener.lifecycleEvent APR capabilities: IPv6 [true], sendfile [true], accept filters [false], random [true].
03-Aug-2020 19:37:23.106 INFO [main] org.apache.catalina.core.AprLifecycleListener.initializeSSL OpenSSL successfully initialized [OpenSSL 3.0.0-alpha6-dev ]
03-Aug-2020 19:37:23.107 INFO [main] org.apache.coyote.AbstractProtocol.init Initializing ProtocolHandler ["http-apr-127.0.0.1-auto-16"]
03-Aug-2020 19:37:23.122 INFO [main] org.apache.catalina.core.StandardService.startInternal Starting service [Tomcat]
03-Aug-2020 19:37:23.124 INFO [main] org.apache.catalina.core.StandardEngine.startInternal Starting Servlet engine: [Apache Tomcat/10.0.0-M8-dev]
03-Aug-2020 19:37:23.141 INFO [main] org.apache.coyote.AbstractProtocol.start Starting ProtocolHandler ["http-apr-127.0.0.1-auto-16-39463"]
03-Aug-2020 19:37:23.179 INFO [main] org.apache.coyote.AbstractProtocol.pause Pausing ProtocolHandler ["http-apr-127.0.0.1-auto-16-39463"]
03-Aug-2020 19:37:23.185 INFO [main] org.apache.catalina.core.StandardService.stopInternal Stopping service [Tomcat]
03-Aug-2020 19:37:23.189 INFO [main] org.apache.coyote.AbstractProtocol.stop Stopping ProtocolHandler ["http-apr-127.0.0.1-auto-16-39463"]
03-Aug-2020 19:37:23.243 INFO [main] org.apache.coyote.AbstractProtocol.destroy Destroying ProtocolHandler ["http-apr-127.0.0.1-auto-16-39463"]
03-Aug-2020 19:37:23.249 INFO [main] org.apache.catalina.startup.LoggingBaseTest.setUp Starting test case [testLaunchTime]
03-Aug-2020 19:37:23.251 INFO [main] org.apache.catalina.core.AprLifecycleListener.lifecycleEvent Loaded Apache Tomcat Native library [1.2.25] using APR version [1.7.0].
03-Aug-2020 19:37:23.251 INFO [main] org.apache.catalina.core.AprLifecycleListener.lifecycleEvent APR capabilities: IPv6 [true], sendfile [true], accept filters [false], random [true].
03-Aug-2020 19:37:23.252 INFO [main] org.apache.catalina.core.AprLifecycleListener.initializeSSL OpenSSL successfully initialized [OpenSSL 3.0.0-alpha6-dev ]
03-Aug-2020 19:37:23.254 INFO [main] org.apache.coyote.AbstractProtocol.init Initializing ProtocolHandler ["http-apr-127.0.0.1-auto-17"]
03-Aug-2020 19:37:23.255 INFO [main] org.apache.catalina.core.StandardService.startInternal Starting service [Tomcat]
03-Aug-2020 19:37:23.255 INFO [main] org.apache.catalina.core.StandardEngine.startInternal Starting Servlet engine: [Apache Tomcat/10.0.0-M8-dev]
03-Aug-2020 19:37:23.264 INFO [main] org.apache.coyote.AbstractProtocol.start Starting ProtocolHandler ["http-apr-127.0.0.1-auto-17-42557"]
03-Aug-2020 19:37:23.282 INFO [main] org.apache.catalina.startup.TestTomcat.testLaunchTime Tomcat started in [32] ms
03-Aug-2020 19:37:23.282 INFO [main] org.apache.coyote.AbstractProtocol.pause Pausing ProtocolHandler ["http-apr-127.0.0.1-auto-17-42557"]
03-Aug-2020 19:37:23.290 INFO [main] org.apache.catalina.core.StandardService.stopInternal Stopping service [Tomcat]
03-Aug-2020 19:37:23.293 INFO [main] org.apache.coyote.AbstractProtocol.stop Stopping ProtocolHandler ["http-apr-127.0.0.1-auto-17-42557"]
03-Aug-2020 19:37:23.349 INFO [main] org.apache.coyote.AbstractProtocol.destroy Destroying ProtocolHandler ["http-apr-127.0.0.1-auto-17-42557"]
03-Aug-2020 19:37:23.352 INFO [main] org.apache.catalina.startup.LoggingBaseTest.setUp Starting test case [testAddWebappUrl]
03-Aug-2020 19:37:23.360 INFO [main] org.apache.catalina.core.AprLifecycleListener.lifecycleEvent Loaded Apache Tomcat Native library [1.2.25] using APR version [1.7.0].
03-Aug-2020 19:37:23.360 INFO [main] org.apache.catalina.core.AprLifecycleListener.lifecycleEvent APR capabilities: IPv6 [true], sendfile [true], accept filters [false], random [true].
03-Aug-2020 19:37:23.361 INFO [main] org.apache.catalina.core.AprLifecycleListener.initializeSSL OpenSSL successfully initialized [OpenSSL 3.0.0-alpha6-dev ]
03-Aug-2020 19:37:23.362 INFO [main] org.apache.coyote.AbstractProtocol.init Initializing ProtocolHandler ["http-apr-127.0.0.1-auto-18"]
03-Aug-2020 19:37:23.363 INFO [main] org.apache.catalina.core.StandardService.startInternal Starting service [Tomcat]
03-Aug-2020 19:37:23.364 INFO [main] org.apache.catalina.core.StandardEngine.startInternal Starting Servlet engine: [Apache Tomcat/10.0.0-M8-dev]
03-Aug-2020 19:37:23.384 INFO [main] org.apache.catalina.startup.ContextConfig.getDefaultWebXmlFragment No global web.xml found
03-Aug-2020 19:37:25.138 INFO [main] org.apache.jasper.servlet.TldScanner.scanJars At least one JAR was scanned for TLDs yet contained no TLDs. Enable debug logging for this logger for a complete list of JARs that were scanned but no TLDs were found in them. Skipping unneeded JARs during scanning can improve startup time and JSP compilation time.
03-Aug-2020 19:37:25.143 INFO [main] org.apache.coyote.AbstractProtocol.start Starting ProtocolHandler ["http-apr-127.0.0.1-auto-18-46075"]
03-Aug-2020 19:37:25.168 INFO [main] org.apache.coyote.AbstractProtocol.pause Pausing ProtocolHandler ["http-apr-127.0.0.1-auto-18-46075"]
03-Aug-2020 19:37:25.174 INFO [main] org.apache.catalina.core.StandardService.stopInternal Stopping service [Tomcat]
03-Aug-2020 19:37:25.178 INFO [main] org.apache.coyote.AbstractProtocol.stop Stopping ProtocolHandler ["http-apr-127.0.0.1-auto-18-46075"]
03-Aug-2020 19:37:25.234 INFO [main] org.apache.coyote.AbstractProtocol.destroy Destroying ProtocolHandler ["http-apr-127.0.0.1-auto-18-46075"]
03-Aug-2020 19:37:25.239 INFO [main] org.apache.catalina.startup.LoggingBaseTest.setUp Starting test case [testEnableNamingGlobal]
03-Aug-2020 19:37:25.241 INFO [main] org.apache.catalina.core.AprLifecycleListener.lifecycleEvent Loaded Apache Tomcat Native library [1.2.25] using APR version [1.7.0].
03-Aug-2020 19:37:25.242 INFO [main] org.apache.catalina.core.AprLifecycleListener.lifecycleEvent APR capabilities: IPv6 [true], sendfile [true], accept filters [false], random [true].
03-Aug-2020 19:37:25.242 INFO [main] org.apache.catalina.core.AprLifecycleListener.initializeSSL OpenSSL successfully initialized [OpenSSL 3.0.0-alpha6-dev ]
03-Aug-2020 19:37:25.244 INFO [main] org.apache.coyote.AbstractProtocol.init Initializing ProtocolHandler ["http-apr-127.0.0.1-auto-19"]
03-Aug-2020 19:37:25.245 INFO [main] org.apache.catalina.core.StandardService.startInternal Starting service [Tomcat]
03-Aug-2020 19:37:25.245 INFO [main] org.apache.catalina.core.StandardEngine.startInternal Starting Servlet engine: [Apache Tomcat/10.0.0-M8-dev]
03-Aug-2020 19:37:25.271 INFO [main] org.apache.coyote.AbstractProtocol.start Starting ProtocolHandler ["http-apr-127.0.0.1-auto-19-39725"]
03-Aug-2020 19:37:25.292 INFO [main] org.apache.coyote.AbstractProtocol.pause Pausing ProtocolHandler ["http-apr-127.0.0.1-auto-19-39725"]
03-Aug-2020 19:37:25.299 INFO [main] org.apache.catalina.core.StandardService.stopInternal Stopping service [Tomcat]
03-Aug-2020 19:37:25.302 INFO [main] org.apache.coyote.AbstractProtocol.stop Stopping ProtocolHandler ["http-apr-127.0.0.1-auto-19-39725"]
03-Aug-2020 19:37:25.356 INFO [main] org.apache.coyote.AbstractProtocol.destroy Destroying ProtocolHandler ["http-apr-127.0.0.1-auto-19-39725"]
03-Aug-2020 19:37:25.361 INFO [main] org.apache.catalina.startup.LoggingBaseTest.setUp Starting test case [testGetBrokenContextPerAddWepapp]
03-Aug-2020 19:37:25.363 INFO [main] org.apache.coyote.AbstractProtocol.destroy Destroying ProtocolHandler ["http-apr-127.0.0.1-auto-20"]
03-Aug-2020 19:37:25.367 INFO [main] org.apache.catalina.startup.LoggingBaseTest.setUp Starting test case [testGetResource]
03-Aug-2020 19:37:25.369 INFO [main] org.apache.catalina.core.AprLifecycleListener.lifecycleEvent Loaded Apache Tomcat Native library [1.2.25] using APR version [1.7.0].
03-Aug-2020 19:37:25.369 INFO [main] org.apache.catalina.core.AprLifecycleListener.lifecycleEvent APR capabilities: IPv6 [true], sendfile [true], accept filters [false], random [true].
03-Aug-2020 19:37:25.370 INFO [main] org.apache.catalina.core.AprLifecycleListener.initializeSSL OpenSSL successfully initialized [OpenSSL 3.0.0-alpha6-dev ]
03-Aug-2020 19:37:25.372 INFO [main] org.apache.coyote.AbstractProtocol.init Initializing ProtocolHandler ["http-apr-127.0.0.1-auto-21"]
03-Aug-2020 19:37:25.372 INFO [main] org.apache.catalina.core.StandardService.startInternal Starting service [Tomcat]
03-Aug-2020 19:37:25.379 INFO [main] org.apache.catalina.core.StandardEngine.startInternal Starting Servlet engine: [Apache Tomcat/10.0.0-M8-dev]
03-Aug-2020 19:37:25.405 INFO [main] org.apache.catalina.startup.ContextConfig.getDefaultWebXmlFragment No global web.xml found
03-Aug-2020 19:37:27.269 INFO [main] org.apache.jasper.servlet.TldScanner.scanJars At least one JAR was scanned for TLDs yet contained no TLDs. Enable debug logging for this logger for a complete list of JARs that were scanned but no TLDs were found in them. Skipping unneeded JARs during scanning can improve startup time and JSP compilation time.
03-Aug-2020 19:37:27.303 INFO [main] org.apache.catalina.core.ApplicationContext.log ContextListener: contextInitialized()
03-Aug-2020 19:37:27.303 INFO [main] org.apache.catalina.core.ApplicationContext.log SessionListener: contextInitialized()
03-Aug-2020 19:37:27.305 INFO [main] org.apache.catalina.core.ApplicationContext.log ContextListener: attributeAdded('StockTicker', 'async.Stockticker@16abeca6')
03-Aug-2020 19:37:27.315 INFO [main] org.apache.coyote.AbstractProtocol.start Starting ProtocolHandler ["http-apr-127.0.0.1-auto-21-40833"]
03-Aug-2020 19:37:27.331 INFO [main] org.apache.coyote.AbstractProtocol.pause Pausing ProtocolHandler ["http-apr-127.0.0.1-auto-21-40833"]
03-Aug-2020 19:37:27.337 INFO [main] org.apache.catalina.core.StandardService.stopInternal Stopping service [Tomcat]
03-Aug-2020 19:37:27.340 INFO [main] org.apache.catalina.core.ApplicationContext.log SessionListener: contextDestroyed()
03-Aug-2020 19:37:27.341 INFO [main] org.apache.catalina.core.ApplicationContext.log ContextListener: contextDestroyed()
03-Aug-2020 19:37:27.345 INFO [main] org.apache.coyote.AbstractProtocol.stop Stopping ProtocolHandler ["http-apr-127.0.0.1-auto-21-40833"]
03-Aug-2020 19:37:27.399 INFO [main] org.apache.coyote.AbstractProtocol.destroy Destroying ProtocolHandler ["http-apr-127.0.0.1-auto-21-40833"]
03-Aug-2020 19:37:27.406 INFO [main] org.apache.catalina.startup.LoggingBaseTest.setUp Starting test case [testGetCustomContextPerAddContextWithHost]
03-Aug-2020 19:37:27.410 INFO [main] org.apache.coyote.AbstractProtocol.destroy Destroying ProtocolHandler ["http-apr-127.0.0.1-auto-22"]
03-Aug-2020 19:37:27.412 INFO [main] org.apache.catalina.startup.LoggingBaseTest.setUp Starting test case [testGetBrokenContextPerAddContext]
03-Aug-2020 19:37:27.414 INFO [main] org.apache.coyote.AbstractProtocol.destroy Destroying ProtocolHandler ["http-apr-127.0.0.1-auto-23"]
03-Aug-2020 19:37:27.415 INFO [main] org.apache.catalina.startup.LoggingBaseTest.setUp Starting test case [testGetDefaultContextPerAddContext]
03-Aug-2020 19:37:27.416 INFO [main] org.apache.coyote.AbstractProtocol.destroy Destroying ProtocolHandler ["http-apr-127.0.0.1-auto-24"]
03-Aug-2020 19:37:27.418 INFO [main] org.apache.catalina.startup.LoggingBaseTest.setUp Starting test case [testSession]
03-Aug-2020 19:37:27.419 INFO [main] org.apache.catalina.core.AprLifecycleListener.lifecycleEvent Loaded Apache Tomcat Native library [1.2.25] using APR version [1.7.0].
03-Aug-2020 19:37:27.420 INFO [main] org.apache.catalina.core.AprLifecycleListener.lifecycleEvent APR capabilities: IPv6 [true], sendfile [true], accept filters [false], random [true].
03-Aug-2020 19:37:27.420 INFO [main] org.apache.catalina.core.AprLifecycleListener.initializeSSL OpenSSL successfully initialized [OpenSSL 3.0.0-alpha6-dev ]
03-Aug-2020 19:37:27.426 INFO [main] org.apache.coyote.AbstractProtocol.init Initializing ProtocolHandler ["http-apr-127.0.0.1-auto-25"]
03-Aug-2020 19:37:27.426 INFO [main] org.apache.catalina.core.StandardService.startInternal Starting service [Tomcat]
03-Aug-2020 19:37:27.427 INFO [main] org.apache.catalina.core.StandardEngine.startInternal Starting Servlet engine: [Apache Tomcat/10.0.0-M8-dev]
03-Aug-2020 19:37:27.441 INFO [main] org.apache.coyote.AbstractProtocol.start Starting ProtocolHandler ["http-apr-127.0.0.1-auto-25-39935"]
03-Aug-2020 19:37:27.458 INFO [main] org.apache.coyote.AbstractProtocol.pause Pausing ProtocolHandler ["http-apr-127.0.0.1-auto-25-39935"]
03-Aug-2020 19:37:27.464 INFO [main] org.apache.catalina.core.StandardService.stopInternal Stopping service [Tomcat]
03-Aug-2020 19:37:27.468 INFO [main] org.apache.coyote.AbstractProtocol.stop Stopping ProtocolHandler ["http-apr-127.0.0.1-auto-25-39935"]
03-Aug-2020 19:37:27.524 INFO [main] org.apache.coyote.AbstractProtocol.destroy Destroying ProtocolHandler ["http-apr-127.0.0.1-auto-25-39935"]
03-Aug-2020 19:37:27.528 INFO [main] org.apache.catalina.startup.LoggingBaseTest.setUp Starting test case [testGetCustomContextPerAddWebappWithNullHost]
03-Aug-2020 19:37:27.530 INFO [main] org.apache.coyote.AbstractProtocol.destroy Destroying ProtocolHandler ["http-apr-127.0.0.1-auto-26"]
------------- ---------------- ---------------

Testcase: testProgrammatic took 2.046 sec
Testcase: testGetDefaultContextPerAddWebapp took 0.024 sec
Testcase: testGetCustomContextPerAddWebappWithHost took 0.015 sec
Testcase: testGetWebappConfigFileFromJarNegative took 0.007 sec
Testcase: testGetWebappConfigFileFromJar took 0.004 sec
Testcase: testGetWebappConfigFileFromDirectoryNegative took 0.003 sec
Testcase: testCustomContextConfig took 0.131 sec
Testcase: testSingleWebapp took 3.326 sec
Testcase: testBrokenWarOne took 0.031 sec
Testcase: testBrokenWarTwo took 0.029 sec
Testcase: testJsps took 4.08 sec
Testcase: testGetWebappConfigFileFromDirectory took 0.003 sec
Testcase: testBug50826 took 0.006 sec
Testcase: testBug51526 took 2.137 sec
Testcase: testBug53301 took 0.109 sec
Testcase: testEnableNaming took 0.177 sec
Testcase: testLaunchTime took 0.103 sec
Testcase: testAddWebappUrl took 1.886 sec
Testcase: testEnableNamingGlobal took 0.122 sec
Testcase: testGetBrokenContextPerAddWepapp took 0.004 sec
Testcase: testGetResource took 2.041 sec
Testcase: testGetCustomContextPerAddContextWithHost took 0.005 sec
Testcase: testGetBrokenContextPerAddContext took 0.003 sec
Testcase: testGetDefaultContextPerAddContext took 0.002 sec
Testcase: testSession took 0.11 sec

Continuation...

Testcase: testGetCustomContextPerAddWebappWithNullHost took 0.003 sec

Apache Gump, Gump, Apache, the Apache feather logo, and the Apache Gump project logos are trademarks of The Apache Software Foundation.

Last Updated: Mon, 03 Aug 2020 12:00:04 ().Python Logo