Run| Workspace| Log| Issues| Fixes| Pre-reqs| Stats| XRef| Maven Repository Proxy Log Gump Logo

Details

File Contents

Testsuite: org.apache.catalina.core.TestStandardContext
Tests run: 24, Failures: 0, Errors: 0, Skipped: 0, Time elapsed: 6.128 sec
------------- Standard Error -----------------
23-Feb-2018 10:49:08.018 INFO [main] org.apache.catalina.startup.LoggingBaseTest.setUp Starting test case [testTldListener]
23-Feb-2018 10:49:08.255 INFO [main] org.apache.catalina.core.AprLifecycleListener.lifecycleEvent Loaded APR based Apache Tomcat Native library [1.2.17] using APR version [1.6.4].
23-Feb-2018 10:49:08.256 INFO [main] org.apache.catalina.core.AprLifecycleListener.lifecycleEvent APR capabilities: IPv6 [true], sendfile [true], accept filters [false], random [true].
23-Feb-2018 10:49:08.256 INFO [main] org.apache.catalina.core.AprLifecycleListener.lifecycleEvent APR/OpenSSL configuration: useAprConnector [false], useOpenSSL [true]
23-Feb-2018 10:49:08.258 INFO [main] org.apache.catalina.core.AprLifecycleListener.initializeSSL OpenSSL successfully initialized [OpenSSL 1.1.1-pre2-dev  xx XXX xxxx]
23-Feb-2018 10:49:08.512 INFO [main] org.apache.coyote.AbstractProtocol.init Initializing ProtocolHandler ["http-apr-127.0.0.1-auto-1"]
23-Feb-2018 10:49:08.570 INFO [main] org.apache.catalina.core.StandardService.startInternal Starting service [Tomcat]
23-Feb-2018 10:49:08.571 INFO [main] org.apache.catalina.core.StandardEngine.startInternal Starting Servlet Engine: Apache Tomcat/9.0.6-dev
23-Feb-2018 10:49:08.785 INFO [main] org.apache.jasper.servlet.TldScanner.scanJars At least one JAR was scanned for TLDs yet contained no TLDs. Enable debug logging for this logger for a complete list of JARs that were scanned but no TLDs were found in them. Skipping unneeded JARs during scanning can improve startup time and JSP compilation time.
23-Feb-2018 10:49:08.815 INFO [main] org.apache.coyote.AbstractProtocol.start Starting ProtocolHandler ["http-apr-127.0.0.1-auto-1-32909"]
23-Feb-2018 10:49:08.845 INFO [main] org.apache.coyote.AbstractProtocol.pause Pausing ProtocolHandler ["http-apr-127.0.0.1-auto-1-32909"]
23-Feb-2018 10:49:08.900 INFO [main] org.apache.catalina.core.StandardService.stopInternal Stopping service [Tomcat]
23-Feb-2018 10:49:08.902 INFO [main] org.apache.coyote.AbstractProtocol.stop Stopping ProtocolHandler ["http-apr-127.0.0.1-auto-1-32909"]
23-Feb-2018 10:49:08.966 INFO [main] org.apache.coyote.AbstractProtocol.destroy Destroying ProtocolHandler ["http-apr-127.0.0.1-auto-1-32909"]
23-Feb-2018 10:49:08.980 INFO [main] org.apache.catalina.startup.LoggingBaseTest.setUp Starting test case [testWebappListenerConfigureFail]
23-Feb-2018 10:49:08.981 INFO [main] org.apache.catalina.core.AprLifecycleListener.lifecycleEvent Loaded APR based Apache Tomcat Native library [1.2.17] using APR version [1.6.4].
23-Feb-2018 10:49:08.982 INFO [main] org.apache.catalina.core.AprLifecycleListener.lifecycleEvent APR capabilities: IPv6 [true], sendfile [true], accept filters [false], random [true].
23-Feb-2018 10:49:08.982 INFO [main] org.apache.catalina.core.AprLifecycleListener.lifecycleEvent APR/OpenSSL configuration: useAprConnector [false], useOpenSSL [true]
23-Feb-2018 10:49:08.982 INFO [main] org.apache.catalina.core.AprLifecycleListener.initializeSSL OpenSSL successfully initialized [OpenSSL 1.1.1-pre2-dev  xx XXX xxxx]
23-Feb-2018 10:49:08.984 INFO [main] org.apache.coyote.AbstractProtocol.init Initializing ProtocolHandler ["http-apr-127.0.0.1-auto-2"]
23-Feb-2018 10:49:08.984 INFO [main] org.apache.catalina.core.StandardService.startInternal Starting service [Tomcat]
23-Feb-2018 10:49:08.984 INFO [main] org.apache.catalina.core.StandardEngine.startInternal Starting Servlet Engine: Apache Tomcat/9.0.6-dev
23-Feb-2018 10:49:08.986 INFO [main] org.apache.coyote.AbstractProtocol.start Starting ProtocolHandler ["http-apr-127.0.0.1-auto-2-36571"]
23-Feb-2018 10:49:09.070 INFO [main] org.apache.catalina.startup.ContextConfig.getDefaultWebXmlFragment No global web.xml found
23-Feb-2018 10:49:10.593 INFO [main] org.apache.coyote.AbstractProtocol.pause Pausing ProtocolHandler ["http-apr-127.0.0.1-auto-2-36571"]
23-Feb-2018 10:49:10.644 INFO [main] org.apache.catalina.core.StandardService.stopInternal Stopping service [Tomcat]
23-Feb-2018 10:49:10.649 INFO [main] org.apache.coyote.AbstractProtocol.stop Stopping ProtocolHandler ["http-apr-127.0.0.1-auto-2-36571"]
23-Feb-2018 10:49:10.702 INFO [main] org.apache.coyote.AbstractProtocol.destroy Destroying ProtocolHandler ["http-apr-127.0.0.1-auto-2-36571"]
23-Feb-2018 10:49:10.710 INFO [main] org.apache.catalina.startup.LoggingBaseTest.setUp Starting test case [testDenyUncoveredHttpMethodsSCITrue]
23-Feb-2018 10:49:10.712 INFO [main] org.apache.catalina.core.AprLifecycleListener.lifecycleEvent Loaded APR based Apache Tomcat Native library [1.2.17] using APR version [1.6.4].
23-Feb-2018 10:49:10.712 INFO [main] org.apache.catalina.core.AprLifecycleListener.lifecycleEvent APR capabilities: IPv6 [true], sendfile [true], accept filters [false], random [true].
23-Feb-2018 10:49:10.712 INFO [main] org.apache.catalina.core.AprLifecycleListener.lifecycleEvent APR/OpenSSL configuration: useAprConnector [false], useOpenSSL [true]
23-Feb-2018 10:49:10.713 INFO [main] org.apache.catalina.core.AprLifecycleListener.initializeSSL OpenSSL successfully initialized [OpenSSL 1.1.1-pre2-dev  xx XXX xxxx]
23-Feb-2018 10:49:10.714 INFO [main] org.apache.coyote.AbstractProtocol.init Initializing ProtocolHandler ["http-apr-127.0.0.1-auto-3"]
23-Feb-2018 10:49:10.719 INFO [main] org.apache.catalina.core.StandardService.startInternal Starting service [Tomcat]
23-Feb-2018 10:49:10.719 INFO [main] org.apache.catalina.core.StandardEngine.startInternal Starting Servlet Engine: Apache Tomcat/9.0.6-dev
23-Feb-2018 10:49:10.730 INFO [main] org.apache.tomcat.util.descriptor.web.SecurityConstraint.findUncoveredHttpMethods Adding security constraints with URL pattern [/test] to deny access with the uncovered HTTP methods that are not one of the following [POST]
23-Feb-2018 10:49:10.732 INFO [main] org.apache.coyote.AbstractProtocol.start Starting ProtocolHandler ["http-apr-127.0.0.1-auto-3-48714"]
23-Feb-2018 10:49:10.757 INFO [main] org.apache.coyote.AbstractProtocol.pause Pausing ProtocolHandler ["http-apr-127.0.0.1-auto-3-48714"]
23-Feb-2018 10:49:10.807 INFO [main] org.apache.catalina.core.StandardService.stopInternal Stopping service [Tomcat]
23-Feb-2018 10:49:10.812 INFO [main] org.apache.coyote.AbstractProtocol.stop Stopping ProtocolHandler ["http-apr-127.0.0.1-auto-3-48714"]
23-Feb-2018 10:49:10.867 INFO [main] org.apache.coyote.AbstractProtocol.destroy Destroying ProtocolHandler ["http-apr-127.0.0.1-auto-3-48714"]
23-Feb-2018 10:49:10.872 INFO [main] org.apache.catalina.startup.LoggingBaseTest.setUp Starting test case [testAddPostConstructMethodNullClassName]
23-Feb-2018 10:49:10.875 INFO [main] org.apache.coyote.AbstractProtocol.destroy Destroying ProtocolHandler ["http-apr-127.0.0.1-auto-4"]
23-Feb-2018 10:49:10.882 INFO [main] org.apache.catalina.startup.LoggingBaseTest.setUp Starting test case [testAddPreDestroyMethodConflicts]
23-Feb-2018 10:49:10.884 INFO [main] org.apache.coyote.AbstractProtocol.destroy Destroying ProtocolHandler ["http-apr-127.0.0.1-auto-5"]
23-Feb-2018 10:49:10.886 INFO [main] org.apache.catalina.startup.LoggingBaseTest.setUp Starting test case [testBug46243]
23-Feb-2018 10:49:10.891 INFO [main] org.apache.catalina.core.AprLifecycleListener.lifecycleEvent Loaded APR based Apache Tomcat Native library [1.2.17] using APR version [1.6.4].
23-Feb-2018 10:49:10.891 INFO [main] org.apache.catalina.core.AprLifecycleListener.lifecycleEvent APR capabilities: IPv6 [true], sendfile [true], accept filters [false], random [true].
23-Feb-2018 10:49:10.892 INFO [main] org.apache.catalina.core.AprLifecycleListener.lifecycleEvent APR/OpenSSL configuration: useAprConnector [false], useOpenSSL [true]
23-Feb-2018 10:49:10.892 INFO [main] org.apache.catalina.core.AprLifecycleListener.lifecycleEvent Loaded APR based Apache Tomcat Native library [1.2.17] using APR version [1.6.4].
23-Feb-2018 10:49:10.892 INFO [main] org.apache.catalina.core.AprLifecycleListener.lifecycleEvent APR capabilities: IPv6 [true], sendfile [true], accept filters [false], random [true].
23-Feb-2018 10:49:10.893 INFO [main] org.apache.catalina.core.AprLifecycleListener.lifecycleEvent APR/OpenSSL configuration: useAprConnector [false], useOpenSSL [true]
23-Feb-2018 10:49:10.893 INFO [main] org.apache.catalina.core.AprLifecycleListener.lifecycleEvent Loaded APR based Apache Tomcat Native library [1.2.17] using APR version [1.6.4].
23-Feb-2018 10:49:10.894 INFO [main] org.apache.catalina.core.AprLifecycleListener.lifecycleEvent APR capabilities: IPv6 [true], sendfile [true], accept filters [false], random [true].
23-Feb-2018 10:49:10.894 INFO [main] org.apache.catalina.core.AprLifecycleListener.lifecycleEvent APR/OpenSSL configuration: useAprConnector [false], useOpenSSL [true]
23-Feb-2018 10:49:10.895 INFO [main] org.apache.catalina.core.AprLifecycleListener.initializeSSL OpenSSL successfully initialized [OpenSSL 1.1.1-pre2-dev  xx XXX xxxx]
23-Feb-2018 10:49:10.897 INFO [main] org.apache.coyote.AbstractProtocol.init Initializing ProtocolHandler ["http-apr-127.0.0.1-auto-6"]
23-Feb-2018 10:49:10.898 INFO [main] org.apache.catalina.core.StandardService.startInternal Starting service [Tomcat]
23-Feb-2018 10:49:10.898 INFO [main] org.apache.catalina.core.StandardEngine.startInternal Starting Servlet Engine: Apache Tomcat/9.0.6-dev
23-Feb-2018 10:49:10.914 SEVERE [main] org.apache.catalina.core.StandardContext.filterStart Exception starting filter [Bug46243]
 javax.servlet.ServletException: Init fail (test)
	at org.apache.catalina.core.TestStandardContext$Bug46243Filter.init(TestStandardContext.java:176)
	at javax.servlet.GenericFilter.init(GenericFilter.java:61)
	at org.apache.catalina.core.ApplicationFilterConfig.initFilter(ApplicationFilterConfig.java:277)
	at org.apache.catalina.core.ApplicationFilterConfig.getFilter(ApplicationFilterConfig.java:258)
	at org.apache.catalina.core.ApplicationFilterConfig.<init>(ApplicationFilterConfig.java:104)
	at org.apache.catalina.core.StandardContext.filterStart(StandardContext.java:4427)
	at org.apache.catalina.core.StandardContext.startInternal(StandardContext.java:5067)
	at org.apache.catalina.util.LifecycleBase.start(LifecycleBase.java:183)
	at org.apache.catalina.core.ContainerBase$StartChild.call(ContainerBase.java:1427)
	at org.apache.catalina.core.ContainerBase$StartChild.call(ContainerBase.java:1417)
	at java.util.concurrent.FutureTask.run(FutureTask.java:266)
	at org.apache.tomcat.util.threads.InlineExecutorService.execute(InlineExecutorService.java:75)
	at java.util.concurrent.AbstractExecutorService.submit(AbstractExecutorService.java:134)
	at org.apache.catalina.core.ContainerBase.startInternal(ContainerBase.java:943)
	at org.apache.catalina.core.StandardHost.startInternal(StandardHost.java:839)
	at org.apache.catalina.util.LifecycleBase.start(LifecycleBase.java:183)
	at org.apache.catalina.core.ContainerBase$StartChild.call(ContainerBase.java:1427)
	at org.apache.catalina.core.ContainerBase$StartChild.call(ContainerBase.java:1417)
	at java.util.concurrent.FutureTask.run(FutureTask.java:266)
	at org.apache.tomcat.util.threads.InlineExecutorService.execute(InlineExecutorService.java:75)
	at java.util.concurrent.AbstractExecutorService.submit(AbstractExecutorService.java:134)
	at org.apache.catalina.core.ContainerBase.startInternal(ContainerBase.java:943)
	at org.apache.catalina.core.StandardEngine.startInternal(StandardEngine.java:258)
	at org.apache.catalina.util.LifecycleBase.start(LifecycleBase.java:183)
	at org.apache.catalina.core.StandardService.startInternal(StandardService.java:422)
	at org.apache.catalina.util.LifecycleBase.start(LifecycleBase.java:183)
	at org.apache.catalina.core.StandardServer.startInternal(StandardServer.java:770)
	at org.apache.catalina.util.LifecycleBase.start(LifecycleBase.java:183)
	at org.apache.catalina.startup.Tomcat.start(Tomcat.java:371)
	at org.apache.catalina.startup.TomcatBaseTest$TomcatWithFastSessionIDs.start(TomcatBaseTest.java:836)
	at org.apache.catalina.core.TestStandardContext.testBug46243(TestStandardContext.java:100)
	at sun.reflect.NativeMethodAccessorImpl.invoke0(Native Method)
	at sun.reflect.NativeMethodAccessorImpl.invoke(NativeMethodAccessorImpl.java:62)
	at sun.reflect.DelegatingMethodAccessorImpl.invoke(DelegatingMethodAccessorImpl.java:43)
	at java.lang.reflect.Method.invoke(Method.java:498)
	at org.junit.runners.model.FrameworkMethod$1.runReflectiveCall(FrameworkMethod.java:59)
	at org.junit.internal.runners.model.ReflectiveCallable.run(ReflectiveCallable.java:12)
	at org.junit.runners.model.FrameworkMethod.invokeExplosively(FrameworkMethod.java:61)
	at org.junit.internal.runners.statements.InvokeMethod.evaluate(InvokeMethod.java:17)
	at org.junit.internal.runners.statements.RunBefores.evaluate(RunBefores.java:26)
	at org.junit.internal.runners.statements.RunAfters.evaluate(RunAfters.java:27)
	at org.junit.rules.TestWatcher$1.evaluate(TestWatcher.java:55)
	at org.junit.runners.BlockJUnit4ClassRunner$1.evaluate(BlockJUnit4ClassRunner.java:100)
	at org.junit.runners.ParentRunner.runLeaf(ParentRunner.java:346)
	at org.junit.runners.BlockJUnit4ClassRunner.runChild(BlockJUnit4ClassRunner.java:103)
	at org.junit.runners.BlockJUnit4ClassRunner.runChild(BlockJUnit4ClassRunner.java:63)
	at org.junit.runners.ParentRunner$3.run(ParentRunner.java:311)
	at org.junit.runners.ParentRunner$1.schedule(ParentRunner.java:76)
	at org.junit.runners.ParentRunner.runChildren(ParentRunner.java:309)
	at org.junit.runners.ParentRunner.access$100(ParentRunner.java:63)
	at org.junit.runners.ParentRunner$2.evaluate(ParentRunner.java:289)
	at org.junit.internal.runners.statements.RunBefores.evaluate(RunBefores.java:26)
	at org.junit.internal.runners.statements.RunAfters.evaluate(RunAfters.java:27)
	at org.junit.runners.ParentRunner.run(ParentRunner.java:393)
	at junit.framework.JUnit4TestAdapter.run(JUnit4TestAdapter.java:48)
	at org.apache.tools.ant.taskdefs.optional.junit.JUnitTestRunner.run(JUnitTestRunner.java:536)
	at org.apache.tools.ant.taskdefs.optional.junit.JUnitTestRunner.launch(JUnitTestRunner.java:1205)
	at org.apache.tools.ant.taskdefs.optional.junit.JUnitTestRunner.main(JUnitTestRunner.java:1048)
Caused by: java.lang.ClassNotFoundException
	... 58 more

23-Feb-2018 10:49:10.917 SEVERE [main] org.apache.catalina.core.StandardContext.startInternal One or more Filters failed to start. Full details will be found in the appropriate container log file
23-Feb-2018 10:49:10.917 SEVERE [main] org.apache.catalina.core.StandardContext.startInternal Context [] startup failed due to previous errors
23-Feb-2018 10:49:10.922 INFO [main] org.apache.coyote.AbstractProtocol.start Starting ProtocolHandler ["http-apr-127.0.0.1-auto-6-43335"]
23-Feb-2018 10:49:10.944 INFO [main] org.apache.coyote.AbstractProtocol.pause Pausing ProtocolHandler ["http-apr-127.0.0.1-auto-6-43335"]
23-Feb-2018 10:49:10.995 INFO [main] org.apache.catalina.core.StandardService.stopInternal Stopping service [Tomcat]
23-Feb-2018 10:49:11.000 INFO [main] org.apache.coyote.AbstractProtocol.stop Stopping ProtocolHandler ["http-apr-127.0.0.1-auto-6-43335"]
23-Feb-2018 10:49:11.054 INFO [main] org.apache.coyote.AbstractProtocol.destroy Destroying ProtocolHandler ["http-apr-127.0.0.1-auto-6-43335"]
23-Feb-2018 10:49:11.059 INFO [main] org.apache.catalina.startup.LoggingBaseTest.setUp Starting test case [testBug49711]
23-Feb-2018 10:49:11.070 INFO [main] org.apache.catalina.core.AprLifecycleListener.lifecycleEvent Loaded APR based Apache Tomcat Native library [1.2.17] using APR version [1.6.4].
23-Feb-2018 10:49:11.070 INFO [main] org.apache.catalina.core.AprLifecycleListener.lifecycleEvent APR capabilities: IPv6 [true], sendfile [true], accept filters [false], random [true].
23-Feb-2018 10:49:11.071 INFO [main] org.apache.catalina.core.AprLifecycleListener.lifecycleEvent APR/OpenSSL configuration: useAprConnector [false], useOpenSSL [true]
23-Feb-2018 10:49:11.072 INFO [main] org.apache.catalina.core.AprLifecycleListener.initializeSSL OpenSSL successfully initialized [OpenSSL 1.1.1-pre2-dev  xx XXX xxxx]
23-Feb-2018 10:49:11.074 INFO [main] org.apache.coyote.AbstractProtocol.init Initializing ProtocolHandler ["http-apr-127.0.0.1-auto-7"]
23-Feb-2018 10:49:11.075 INFO [main] org.apache.catalina.core.StandardService.startInternal Starting service [Tomcat]
23-Feb-2018 10:49:11.076 INFO [main] org.apache.catalina.core.StandardEngine.startInternal Starting Servlet Engine: Apache Tomcat/9.0.6-dev
23-Feb-2018 10:49:11.090 INFO [main] org.apache.coyote.AbstractProtocol.start Starting ProtocolHandler ["http-apr-127.0.0.1-auto-7-35293"]
23-Feb-2018 10:49:11.106 SEVERE [http-apr-127.0.0.1-auto-7-exec-1] org.apache.catalina.core.StandardWrapperValve.invoke Servlet.service() for servlet [regular] in context with path [] threw exception
 java.lang.IllegalStateException: Unable to process parts as no multi-part configuration has been provided
	at org.apache.catalina.connector.Request.parseParts(Request.java:2751)
	at org.apache.catalina.connector.Request.getParts(Request.java:2717)
	at org.apache.catalina.connector.RequestFacade.getParts(RequestFacade.java:1098)
	at org.apache.catalina.core.TestStandardContext$Bug49711Servlet.service(TestStandardContext.java:704)
	at javax.servlet.http.HttpServlet.service(HttpServlet.java:741)
	at org.apache.catalina.core.ApplicationFilterChain.internalDoFilter(ApplicationFilterChain.java:231)
	at org.apache.catalina.core.ApplicationFilterChain.doFilter(ApplicationFilterChain.java:166)
	at org.apache.catalina.core.StandardWrapperValve.invoke(StandardWrapperValve.java:199)
	at org.apache.catalina.core.StandardContextValve.invoke(StandardContextValve.java:96)
	at org.apache.catalina.authenticator.AuthenticatorBase.invoke(AuthenticatorBase.java:494)
	at org.apache.catalina.core.StandardHostValve.invoke(StandardHostValve.java:137)
	at org.apache.catalina.valves.ErrorReportValve.invoke(ErrorReportValve.java:92)
	at org.apache.catalina.valves.AbstractAccessLogValve.invoke(AbstractAccessLogValve.java:651)
	at org.apache.catalina.core.StandardEngineValve.invoke(StandardEngineValve.java:87)
	at org.apache.catalina.connector.CoyoteAdapter.service(CoyoteAdapter.java:343)
	at org.apache.coyote.http11.Http11Processor.service(Http11Processor.java:407)
	at org.apache.coyote.AbstractProcessorLight.process(AbstractProcessorLight.java:66)
	at org.apache.coyote.AbstractProtocol$ConnectionHandler.process(AbstractProtocol.java:754)
	at org.apache.tomcat.util.net.AprEndpoint$SocketWithOptionsProcessor.run(AprEndpoint.java:2270)
	at java.util.concurrent.ThreadPoolExecutor.runWorker(ThreadPoolExecutor.java:1149)
	at java.util.concurrent.ThreadPoolExecutor$Worker.run(ThreadPoolExecutor.java:624)
	at org.apache.tomcat.util.threads.TaskThread$WrappingRunnable.run(TaskThread.java:61)
	at java.lang.Thread.run(Thread.java:748)

23-Feb-2018 10:49:11.159 SEVERE [http-apr-127.0.0.1-auto-7-exec-3] org.apache.catalina.core.StandardWrapperValve.invoke Servlet.service() for servlet [regular] in context with path [] threw exception
 java.lang.IllegalStateException: Unable to process parts as no multi-part configuration has been provided
	at org.apache.catalina.connector.Request.parseParts(Request.java:2751)
	at org.apache.catalina.connector.Request.getParts(Request.java:2717)
	at org.apache.catalina.connector.RequestFacade.getParts(RequestFacade.java:1098)
	at org.apache.catalina.core.TestStandardContext$Bug49711Servlet.service(TestStandardContext.java:704)
	at javax.servlet.http.HttpServlet.service(HttpServlet.java:741)
	at org.apache.catalina.core.ApplicationFilterChain.internalDoFilter(ApplicationFilterChain.java:231)
	at org.apache.catalina.core.ApplicationFilterChain.doFilter(ApplicationFilterChain.java:166)
	at org.apache.catalina.core.StandardWrapperValve.invoke(StandardWrapperValve.java:199)

Continuation...

	at org.apache.catalina.core.StandardContextValve.invoke(StandardContextValve.java:96)
	at org.apache.catalina.authenticator.AuthenticatorBase.invoke(AuthenticatorBase.java:494)
	at org.apache.catalina.core.StandardHostValve.invoke(StandardHostValve.java:137)
	at org.apache.catalina.valves.ErrorReportValve.invoke(ErrorReportValve.java:92)
	at org.apache.catalina.valves.AbstractAccessLogValve.invoke(AbstractAccessLogValve.java:651)
	at org.apache.catalina.core.StandardEngineValve.invoke(StandardEngineValve.java:87)
	at org.apache.catalina.connector.CoyoteAdapter.service(CoyoteAdapter.java:343)
	at org.apache.coyote.http11.Http11Processor.service(Http11Processor.java:407)
	at org.apache.coyote.AbstractProcessorLight.process(AbstractProcessorLight.java:66)
	at org.apache.coyote.AbstractProtocol$ConnectionHandler.process(AbstractProtocol.java:754)
	at org.apache.tomcat.util.net.AprEndpoint$SocketWithOptionsProcessor.run(AprEndpoint.java:2270)
	at java.util.concurrent.ThreadPoolExecutor.runWorker(ThreadPoolExecutor.java:1149)
	at java.util.concurrent.ThreadPoolExecutor$Worker.run(ThreadPoolExecutor.java:624)
	at org.apache.tomcat.util.threads.TaskThread$WrappingRunnable.run(TaskThread.java:61)
	at java.lang.Thread.run(Thread.java:748)

23-Feb-2018 10:49:11.164 INFO [main] org.apache.coyote.AbstractProtocol.pause Pausing ProtocolHandler ["http-apr-127.0.0.1-auto-7-35293"]
23-Feb-2018 10:49:11.215 INFO [main] org.apache.catalina.core.StandardService.stopInternal Stopping service [Tomcat]
23-Feb-2018 10:49:11.217 INFO [main] org.apache.coyote.AbstractProtocol.stop Stopping ProtocolHandler ["http-apr-127.0.0.1-auto-7-35293"]
23-Feb-2018 10:49:11.271 INFO [main] org.apache.coyote.AbstractProtocol.destroy Destroying ProtocolHandler ["http-apr-127.0.0.1-auto-7-35293"]
23-Feb-2018 10:49:11.276 INFO [main] org.apache.catalina.startup.LoggingBaseTest.setUp Starting test case [testBug49922]
23-Feb-2018 10:49:11.280 INFO [main] org.apache.catalina.core.AprLifecycleListener.lifecycleEvent Loaded APR based Apache Tomcat Native library [1.2.17] using APR version [1.6.4].
23-Feb-2018 10:49:11.280 INFO [main] org.apache.catalina.core.AprLifecycleListener.lifecycleEvent APR capabilities: IPv6 [true], sendfile [true], accept filters [false], random [true].
23-Feb-2018 10:49:11.280 INFO [main] org.apache.catalina.core.AprLifecycleListener.lifecycleEvent APR/OpenSSL configuration: useAprConnector [false], useOpenSSL [true]
23-Feb-2018 10:49:11.281 INFO [main] org.apache.catalina.core.AprLifecycleListener.initializeSSL OpenSSL successfully initialized [OpenSSL 1.1.1-pre2-dev  xx XXX xxxx]
23-Feb-2018 10:49:11.284 INFO [main] org.apache.coyote.AbstractProtocol.init Initializing ProtocolHandler ["http-apr-127.0.0.1-auto-8"]
23-Feb-2018 10:49:11.285 INFO [main] org.apache.catalina.core.StandardService.startInternal Starting service [Tomcat]
23-Feb-2018 10:49:11.285 INFO [main] org.apache.catalina.core.StandardEngine.startInternal Starting Servlet Engine: Apache Tomcat/9.0.6-dev
23-Feb-2018 10:49:11.299 INFO [main] org.apache.catalina.startup.ContextConfig.getDefaultWebXmlFragment No global web.xml found
23-Feb-2018 10:49:11.585 INFO [main] org.apache.coyote.AbstractProtocol.start Starting ProtocolHandler ["http-apr-127.0.0.1-auto-8-37988"]
23-Feb-2018 10:49:11.639 INFO [main] org.apache.coyote.AbstractProtocol.pause Pausing ProtocolHandler ["http-apr-127.0.0.1-auto-8-37988"]
23-Feb-2018 10:49:11.640 INFO [main] org.apache.catalina.core.StandardService.stopInternal Stopping service [Tomcat]
23-Feb-2018 10:49:11.645 INFO [main] org.apache.coyote.AbstractProtocol.stop Stopping ProtocolHandler ["http-apr-127.0.0.1-auto-8-37988"]
23-Feb-2018 10:49:11.700 INFO [main] org.apache.coyote.AbstractProtocol.destroy Destroying ProtocolHandler ["http-apr-127.0.0.1-auto-8-37988"]
23-Feb-2018 10:49:11.703 INFO [main] org.apache.catalina.startup.LoggingBaseTest.setUp Starting test case [testBug50015]
23-Feb-2018 10:49:11.705 INFO [main] org.apache.catalina.core.AprLifecycleListener.lifecycleEvent Loaded APR based Apache Tomcat Native library [1.2.17] using APR version [1.6.4].
23-Feb-2018 10:49:11.705 INFO [main] org.apache.catalina.core.AprLifecycleListener.lifecycleEvent APR capabilities: IPv6 [true], sendfile [true], accept filters [false], random [true].
23-Feb-2018 10:49:11.705 INFO [main] org.apache.catalina.core.AprLifecycleListener.lifecycleEvent APR/OpenSSL configuration: useAprConnector [false], useOpenSSL [true]
23-Feb-2018 10:49:11.705 INFO [main] org.apache.catalina.core.AprLifecycleListener.initializeSSL OpenSSL successfully initialized [OpenSSL 1.1.1-pre2-dev  xx XXX xxxx]
23-Feb-2018 10:49:11.706 INFO [main] org.apache.coyote.AbstractProtocol.init Initializing ProtocolHandler ["http-apr-127.0.0.1-auto-9"]
23-Feb-2018 10:49:11.713 INFO [main] org.apache.catalina.core.StandardService.startInternal Starting service [Tomcat]
23-Feb-2018 10:49:11.713 INFO [main] org.apache.catalina.core.StandardEngine.startInternal Starting Servlet Engine: Apache Tomcat/9.0.6-dev
23-Feb-2018 10:49:11.724 INFO [main] org.apache.coyote.AbstractProtocol.start Starting ProtocolHandler ["http-apr-127.0.0.1-auto-9-45671"]
23-Feb-2018 10:49:11.741 INFO [main] org.apache.coyote.AbstractProtocol.pause Pausing ProtocolHandler ["http-apr-127.0.0.1-auto-9-45671"]
23-Feb-2018 10:49:11.794 INFO [main] org.apache.catalina.core.StandardService.stopInternal Stopping service [Tomcat]
23-Feb-2018 10:49:11.799 INFO [main] org.apache.coyote.AbstractProtocol.stop Stopping ProtocolHandler ["http-apr-127.0.0.1-auto-9-45671"]
23-Feb-2018 10:49:11.853 INFO [main] org.apache.coyote.AbstractProtocol.destroy Destroying ProtocolHandler ["http-apr-127.0.0.1-auto-9-45671"]
23-Feb-2018 10:49:11.859 INFO [main] org.apache.catalina.startup.LoggingBaseTest.setUp Starting test case [testBug56085]
23-Feb-2018 10:49:11.861 INFO [main] org.apache.catalina.core.AprLifecycleListener.lifecycleEvent Loaded APR based Apache Tomcat Native library [1.2.17] using APR version [1.6.4].
23-Feb-2018 10:49:11.863 INFO [main] org.apache.catalina.core.AprLifecycleListener.lifecycleEvent APR capabilities: IPv6 [true], sendfile [true], accept filters [false], random [true].
23-Feb-2018 10:49:11.864 INFO [main] org.apache.catalina.core.AprLifecycleListener.lifecycleEvent APR/OpenSSL configuration: useAprConnector [false], useOpenSSL [true]
23-Feb-2018 10:49:11.865 INFO [main] org.apache.catalina.core.AprLifecycleListener.initializeSSL OpenSSL successfully initialized [OpenSSL 1.1.1-pre2-dev  xx XXX xxxx]
23-Feb-2018 10:49:11.870 INFO [main] org.apache.coyote.AbstractProtocol.init Initializing ProtocolHandler ["http-apr-127.0.0.1-auto-10"]
23-Feb-2018 10:49:11.871 INFO [main] org.apache.catalina.core.StandardService.startInternal Starting service [Tomcat]
23-Feb-2018 10:49:11.871 INFO [main] org.apache.catalina.core.StandardEngine.startInternal Starting Servlet Engine: Apache Tomcat/9.0.6-dev
23-Feb-2018 10:49:11.893 INFO [main] org.apache.catalina.startup.ContextConfig.getDefaultWebXmlFragment No global web.xml found
23-Feb-2018 10:49:12.185 INFO [main] org.apache.coyote.AbstractProtocol.start Starting ProtocolHandler ["http-apr-127.0.0.1-auto-10-60131"]
23-Feb-2018 10:49:12.198 INFO [main] org.apache.coyote.AbstractProtocol.pause Pausing ProtocolHandler ["http-apr-127.0.0.1-auto-10-60131"]
23-Feb-2018 10:49:12.249 INFO [main] org.apache.catalina.core.StandardService.stopInternal Stopping service [Tomcat]
23-Feb-2018 10:49:12.256 INFO [main] org.apache.coyote.AbstractProtocol.stop Stopping ProtocolHandler ["http-apr-127.0.0.1-auto-10-60131"]
23-Feb-2018 10:49:12.313 INFO [main] org.apache.coyote.AbstractProtocol.destroy Destroying ProtocolHandler ["http-apr-127.0.0.1-auto-10-60131"]
23-Feb-2018 10:49:12.321 INFO [main] org.apache.catalina.startup.LoggingBaseTest.setUp Starting test case [testBug56903]
23-Feb-2018 10:49:12.332 INFO [main] org.apache.coyote.AbstractProtocol.destroy Destroying ProtocolHandler ["http-apr-127.0.0.1-auto-11"]
23-Feb-2018 10:49:12.334 INFO [main] org.apache.catalina.startup.LoggingBaseTest.setUp Starting test case [testWebappLoaderStartFail]
23-Feb-2018 10:49:12.335 INFO [main] org.apache.catalina.core.AprLifecycleListener.lifecycleEvent Loaded APR based Apache Tomcat Native library [1.2.17] using APR version [1.6.4].
23-Feb-2018 10:49:12.341 INFO [main] org.apache.catalina.core.AprLifecycleListener.lifecycleEvent APR capabilities: IPv6 [true], sendfile [true], accept filters [false], random [true].
23-Feb-2018 10:49:12.341 INFO [main] org.apache.catalina.core.AprLifecycleListener.lifecycleEvent APR/OpenSSL configuration: useAprConnector [false], useOpenSSL [true]
23-Feb-2018 10:49:12.341 INFO [main] org.apache.catalina.core.AprLifecycleListener.lifecycleEvent Loaded APR based Apache Tomcat Native library [1.2.17] using APR version [1.6.4].
23-Feb-2018 10:49:12.341 INFO [main] org.apache.catalina.core.AprLifecycleListener.lifecycleEvent APR capabilities: IPv6 [true], sendfile [true], accept filters [false], random [true].
23-Feb-2018 10:49:12.341 INFO [main] org.apache.catalina.core.AprLifecycleListener.lifecycleEvent APR/OpenSSL configuration: useAprConnector [false], useOpenSSL [true]
23-Feb-2018 10:49:12.342 INFO [main] org.apache.catalina.core.AprLifecycleListener.initializeSSL OpenSSL successfully initialized [OpenSSL 1.1.1-pre2-dev  xx XXX xxxx]
23-Feb-2018 10:49:12.343 INFO [main] org.apache.coyote.AbstractProtocol.init Initializing ProtocolHandler ["http-apr-127.0.0.1-auto-12"]
23-Feb-2018 10:49:12.344 INFO [main] org.apache.catalina.core.StandardService.startInternal Starting service [Tomcat]
23-Feb-2018 10:49:12.345 INFO [main] org.apache.catalina.core.StandardEngine.startInternal Starting Servlet Engine: Apache Tomcat/9.0.6-dev
23-Feb-2018 10:49:12.347 INFO [main] org.apache.coyote.AbstractProtocol.start Starting ProtocolHandler ["http-apr-127.0.0.1-auto-12-40885"]
23-Feb-2018 10:49:12.401 INFO [main] org.apache.catalina.startup.ContextConfig.getDefaultWebXmlFragment No global web.xml found
23-Feb-2018 10:49:12.643 INFO [main] org.apache.coyote.AbstractProtocol.pause Pausing ProtocolHandler ["http-apr-127.0.0.1-auto-12-40885"]
23-Feb-2018 10:49:12.644 INFO [main] org.apache.catalina.core.StandardService.stopInternal Stopping service [Tomcat]
23-Feb-2018 10:49:12.649 INFO [main] org.apache.coyote.AbstractProtocol.stop Stopping ProtocolHandler ["http-apr-127.0.0.1-auto-12-40885"]
23-Feb-2018 10:49:12.703 INFO [main] org.apache.coyote.AbstractProtocol.destroy Destroying ProtocolHandler ["http-apr-127.0.0.1-auto-12-40885"]
23-Feb-2018 10:49:12.710 INFO [main] org.apache.catalina.startup.LoggingBaseTest.setUp Starting test case [testUncoveredMethods]
23-Feb-2018 10:49:12.713 INFO [main] org.apache.catalina.core.AprLifecycleListener.lifecycleEvent Loaded APR based Apache Tomcat Native library [1.2.17] using APR version [1.6.4].
23-Feb-2018 10:49:12.714 INFO [main] org.apache.catalina.core.AprLifecycleListener.lifecycleEvent APR capabilities: IPv6 [true], sendfile [true], accept filters [false], random [true].
23-Feb-2018 10:49:12.714 INFO [main] org.apache.catalina.core.AprLifecycleListener.lifecycleEvent APR/OpenSSL configuration: useAprConnector [false], useOpenSSL [true]
23-Feb-2018 10:49:12.715 INFO [main] org.apache.catalina.core.AprLifecycleListener.initializeSSL OpenSSL successfully initialized [OpenSSL 1.1.1-pre2-dev  xx XXX xxxx]
23-Feb-2018 10:49:12.720 INFO [main] org.apache.coyote.AbstractProtocol.init Initializing ProtocolHandler ["http-apr-127.0.0.1-auto-13"]
23-Feb-2018 10:49:12.721 INFO [main] org.apache.catalina.core.StandardService.startInternal Starting service [Tomcat]
23-Feb-2018 10:49:12.721 INFO [main] org.apache.catalina.core.StandardEngine.startInternal Starting Servlet Engine: Apache Tomcat/9.0.6-dev
23-Feb-2018 10:49:12.742 INFO [main] org.apache.coyote.AbstractProtocol.start Starting ProtocolHandler ["http-apr-127.0.0.1-auto-13-40757"]
23-Feb-2018 10:49:12.760 INFO [main] org.apache.coyote.AbstractProtocol.pause Pausing ProtocolHandler ["http-apr-127.0.0.1-auto-13-40757"]
23-Feb-2018 10:49:12.811 INFO [main] org.apache.catalina.core.StandardService.stopInternal Stopping service [Tomcat]
23-Feb-2018 10:49:12.815 INFO [main] org.apache.coyote.AbstractProtocol.stop Stopping ProtocolHandler ["http-apr-127.0.0.1-auto-13-40757"]
23-Feb-2018 10:49:12.868 INFO [main] org.apache.coyote.AbstractProtocol.destroy Destroying ProtocolHandler ["http-apr-127.0.0.1-auto-13-40757"]
23-Feb-2018 10:49:12.870 INFO [main] org.apache.catalina.startup.LoggingBaseTest.setUp Starting test case [testBug51376a]
23-Feb-2018 10:49:12.871 INFO [main] org.apache.catalina.core.AprLifecycleListener.lifecycleEvent Loaded APR based Apache Tomcat Native library [1.2.17] using APR version [1.6.4].
23-Feb-2018 10:49:12.871 INFO [main] org.apache.catalina.core.AprLifecycleListener.lifecycleEvent APR capabilities: IPv6 [true], sendfile [true], accept filters [false], random [true].
23-Feb-2018 10:49:12.871 INFO [main] org.apache.catalina.core.AprLifecycleListener.lifecycleEvent APR/OpenSSL configuration: useAprConnector [false], useOpenSSL [true]
23-Feb-2018 10:49:12.871 INFO [main] org.apache.catalina.core.AprLifecycleListener.initializeSSL OpenSSL successfully initialized [OpenSSL 1.1.1-pre2-dev  xx XXX xxxx]
23-Feb-2018 10:49:12.872 INFO [main] org.apache.coyote.AbstractProtocol.init Initializing ProtocolHandler ["http-apr-127.0.0.1-auto-14"]
23-Feb-2018 10:49:12.872 INFO [main] org.apache.catalina.core.StandardService.startInternal Starting service [Tomcat]
23-Feb-2018 10:49:12.872 INFO [main] org.apache.catalina.core.StandardEngine.startInternal Starting Servlet Engine: Apache Tomcat/9.0.6-dev
23-Feb-2018 10:49:12.887 INFO [main] org.apache.coyote.AbstractProtocol.start Starting ProtocolHandler ["http-apr-127.0.0.1-auto-14-42785"]
23-Feb-2018 10:49:12.895 INFO [main] org.apache.coyote.AbstractProtocol.pause Pausing ProtocolHandler ["http-apr-127.0.0.1-auto-14-42785"]
23-Feb-2018 10:49:12.945 INFO [main] org.apache.catalina.core.StandardService.stopInternal Stopping service [Tomcat]
23-Feb-2018 10:49:12.946 INFO [main] org.apache.coyote.AbstractProtocol.stop Stopping ProtocolHandler ["http-apr-127.0.0.1-auto-14-42785"]
23-Feb-2018 10:49:12.998 INFO [main] org.apache.coyote.AbstractProtocol.destroy Destroying ProtocolHandler ["http-apr-127.0.0.1-auto-14-42785"]
23-Feb-2018 10:49:12.999 INFO [main] org.apache.catalina.startup.LoggingBaseTest.setUp Starting test case [testBug51376b]
23-Feb-2018 10:49:13.001 INFO [main] org.apache.catalina.core.AprLifecycleListener.lifecycleEvent Loaded APR based Apache Tomcat Native library [1.2.17] using APR version [1.6.4].
23-Feb-2018 10:49:13.001 INFO [main] org.apache.catalina.core.AprLifecycleListener.lifecycleEvent APR capabilities: IPv6 [true], sendfile [true], accept filters [false], random [true].
23-Feb-2018 10:49:13.001 INFO [main] org.apache.catalina.core.AprLifecycleListener.lifecycleEvent APR/OpenSSL configuration: useAprConnector [false], useOpenSSL [true]
23-Feb-2018 10:49:13.002 INFO [main] org.apache.catalina.core.AprLifecycleListener.initializeSSL OpenSSL successfully initialized [OpenSSL 1.1.1-pre2-dev  xx XXX xxxx]
23-Feb-2018 10:49:13.003 INFO [main] org.apache.coyote.AbstractProtocol.init Initializing ProtocolHandler ["http-apr-127.0.0.1-auto-15"]
23-Feb-2018 10:49:13.004 INFO [main] org.apache.catalina.core.StandardService.startInternal Starting service [Tomcat]
23-Feb-2018 10:49:13.004 INFO [main] org.apache.catalina.core.StandardEngine.startInternal Starting Servlet Engine: Apache Tomcat/9.0.6-dev
23-Feb-2018 10:49:13.010 INFO [main] org.apache.coyote.AbstractProtocol.start Starting ProtocolHandler ["http-apr-127.0.0.1-auto-15-36221"]
23-Feb-2018 10:49:13.015 INFO [main] org.apache.coyote.AbstractProtocol.pause Pausing ProtocolHandler ["http-apr-127.0.0.1-auto-15-36221"]
23-Feb-2018 10:49:13.065 INFO [main] org.apache.catalina.core.StandardService.stopInternal Stopping service [Tomcat]
23-Feb-2018 10:49:13.066 INFO [main] org.apache.coyote.AbstractProtocol.stop Stopping ProtocolHandler ["http-apr-127.0.0.1-auto-15-36221"]
23-Feb-2018 10:49:13.118 INFO [main] org.apache.coyote.AbstractProtocol.destroy Destroying ProtocolHandler ["http-apr-127.0.0.1-auto-15-36221"]
23-Feb-2018 10:49:13.120 INFO [main] org.apache.catalina.startup.LoggingBaseTest.setUp Starting test case [testBug57556a]
23-Feb-2018 10:49:13.123 INFO [main] org.apache.catalina.core.AprLifecycleListener.lifecycleEvent Loaded APR based Apache Tomcat Native library [1.2.17] using APR version [1.6.4].
23-Feb-2018 10:49:13.123 INFO [main] org.apache.catalina.core.AprLifecycleListener.lifecycleEvent APR capabilities: IPv6 [true], sendfile [true], accept filters [false], random [true].
23-Feb-2018 10:49:13.123 INFO [main] org.apache.catalina.core.AprLifecycleListener.lifecycleEvent APR/OpenSSL configuration: useAprConnector [false], useOpenSSL [true]
23-Feb-2018 10:49:13.123 INFO [main] org.apache.catalina.core.AprLifecycleListener.initializeSSL OpenSSL successfully initialized [OpenSSL 1.1.1-pre2-dev  xx XXX xxxx]
23-Feb-2018 10:49:13.124 INFO [main] org.apache.coyote.AbstractProtocol.init Initializing ProtocolHandler ["http-apr-127.0.0.1-auto-16"]
23-Feb-2018 10:49:13.124 INFO [main] org.apache.catalina.core.StandardService.startInternal Starting service [Tomcat]
23-Feb-2018 10:49:13.124 INFO [main] org.apache.catalina.core.StandardEngine.startInternal Starting Servlet Engine: Apache Tomcat/9.0.6-dev
23-Feb-2018 10:49:13.137 INFO [main] org.apache.catalina.startup.ContextConfig.getDefaultWebXmlFragment No global web.xml found
23-Feb-2018 10:49:13.316 INFO [main] org.apache.coyote.AbstractProtocol.start Starting ProtocolHandler ["http-apr-127.0.0.1-auto-16-54923"]
23-Feb-2018 10:49:13.332 INFO [main] org.apache.coyote.AbstractProtocol.pause Pausing ProtocolHandler ["http-apr-127.0.0.1-auto-16-54923"]
23-Feb-2018 10:49:13.383 INFO [main] org.apache.catalina.core.StandardService.stopInternal Stopping service [Tomcat]
23-Feb-2018 10:49:13.385 INFO [main] org.apache.coyote.AbstractProtocol.stop Stopping ProtocolHandler ["http-apr-127.0.0.1-auto-16-54923"]
23-Feb-2018 10:49:13.438 INFO [main] org.apache.coyote.AbstractProtocol.destroy Destroying ProtocolHandler ["http-apr-127.0.0.1-auto-16-54923"]
23-Feb-2018 10:49:13.440 INFO [main] org.apache.catalina.startup.LoggingBaseTest.setUp Starting test case [testBug57556b]
23-Feb-2018 10:49:13.445 INFO [main] org.apache.catalina.core.AprLifecycleListener.lifecycleEvent Loaded APR based Apache Tomcat Native library [1.2.17] using APR version [1.6.4].
23-Feb-2018 10:49:13.446 INFO [main] org.apache.catalina.core.AprLifecycleListener.lifecycleEvent APR capabilities: IPv6 [true], sendfile [true], accept filters [false], random [true].
23-Feb-2018 10:49:13.446 INFO [main] org.apache.catalina.core.AprLifecycleListener.lifecycleEvent APR/OpenSSL configuration: useAprConnector [false], useOpenSSL [true]
23-Feb-2018 10:49:13.446 INFO [main] org.apache.catalina.core.AprLifecycleListener.initializeSSL OpenSSL successfully initialized [OpenSSL 1.1.1-pre2-dev  xx XXX xxxx]
23-Feb-2018 10:49:13.447 INFO [main] org.apache.coyote.AbstractProtocol.init Initializing ProtocolHandler ["http-apr-127.0.0.1-auto-17"]
23-Feb-2018 10:49:13.447 INFO [main] org.apache.catalina.core.StandardService.startInternal Starting service [Tomcat]
23-Feb-2018 10:49:13.447 INFO [main] org.apache.catalina.core.StandardEngine.startInternal Starting Servlet Engine: Apache Tomcat/9.0.6-dev
23-Feb-2018 10:49:13.461 INFO [main] org.apache.coyote.AbstractProtocol.start Starting ProtocolHandler ["http-apr-127.0.0.1-auto-17-47393"]
23-Feb-2018 10:49:13.464 INFO [main] org.apache.coyote.AbstractProtocol.pause Pausing ProtocolHandler ["http-apr-127.0.0.1-auto-17-47393"]
23-Feb-2018 10:49:13.514 INFO [main] org.apache.catalina.core.StandardService.stopInternal Stopping service [Tomcat]

Continuation...

23-Feb-2018 10:49:13.517 INFO [main] org.apache.coyote.AbstractProtocol.stop Stopping ProtocolHandler ["http-apr-127.0.0.1-auto-17-47393"]
23-Feb-2018 10:49:13.569 INFO [main] org.apache.coyote.AbstractProtocol.destroy Destroying ProtocolHandler ["http-apr-127.0.0.1-auto-17-47393"]
23-Feb-2018 10:49:13.572 INFO [main] org.apache.catalina.startup.LoggingBaseTest.setUp Starting test case [testFlagFailCtxIfServletStartFails]
23-Feb-2018 10:49:13.585 INFO [main] org.apache.catalina.core.AprLifecycleListener.lifecycleEvent Loaded APR based Apache Tomcat Native library [1.2.17] using APR version [1.6.4].
23-Feb-2018 10:49:13.585 INFO [main] org.apache.catalina.core.AprLifecycleListener.lifecycleEvent APR capabilities: IPv6 [true], sendfile [true], accept filters [false], random [true].
23-Feb-2018 10:49:13.585 INFO [main] org.apache.catalina.core.AprLifecycleListener.lifecycleEvent APR/OpenSSL configuration: useAprConnector [false], useOpenSSL [true]
23-Feb-2018 10:49:13.586 INFO [main] org.apache.catalina.core.AprLifecycleListener.initializeSSL OpenSSL successfully initialized [OpenSSL 1.1.1-pre2-dev  xx XXX xxxx]
23-Feb-2018 10:49:13.587 INFO [main] org.apache.coyote.AbstractProtocol.init Initializing ProtocolHandler ["http-apr-127.0.0.1-auto-18"]
23-Feb-2018 10:49:13.588 INFO [main] org.apache.catalina.core.StandardService.startInternal Starting service [Tomcat]
23-Feb-2018 10:49:13.589 INFO [main] org.apache.catalina.core.StandardEngine.startInternal Starting Servlet Engine: Apache Tomcat/9.0.6-dev
23-Feb-2018 10:49:13.596 SEVERE [main] org.apache.catalina.core.StandardContext.loadOnStartup Servlet [myservlet] in web application [] threw load() exception
 javax.servlet.ServletException: failing on purpose
	at org.apache.catalina.core.TestStandardContext$FailingStartupServlet.init(TestStandardContext.java:908)
	at javax.servlet.GenericServlet.init(GenericServlet.java:158)
	at org.apache.catalina.startup.Tomcat$ExistingStandardWrapper.loadServlet(Tomcat.java:1042)
	at org.apache.catalina.core.StandardWrapper.load(StandardWrapper.java:971)
	at org.apache.catalina.core.StandardContext.loadOnStartup(StandardContext.java:4765)
	at org.apache.catalina.core.StandardContext.startInternal(StandardContext.java:5075)
	at org.apache.catalina.util.LifecycleBase.start(LifecycleBase.java:183)
	at org.apache.catalina.core.ContainerBase$StartChild.call(ContainerBase.java:1427)
	at org.apache.catalina.core.ContainerBase$StartChild.call(ContainerBase.java:1417)
	at java.util.concurrent.FutureTask.run(FutureTask.java:266)
	at org.apache.tomcat.util.threads.InlineExecutorService.execute(InlineExecutorService.java:75)
	at java.util.concurrent.AbstractExecutorService.submit(AbstractExecutorService.java:134)
	at org.apache.catalina.core.ContainerBase.startInternal(ContainerBase.java:943)
	at org.apache.catalina.core.StandardHost.startInternal(StandardHost.java:839)
	at org.apache.catalina.util.LifecycleBase.start(LifecycleBase.java:183)
	at org.apache.catalina.core.ContainerBase$StartChild.call(ContainerBase.java:1427)
	at org.apache.catalina.core.ContainerBase$StartChild.call(ContainerBase.java:1417)
	at java.util.concurrent.FutureTask.run(FutureTask.java:266)
	at org.apache.tomcat.util.threads.InlineExecutorService.execute(InlineExecutorService.java:75)
	at java.util.concurrent.AbstractExecutorService.submit(AbstractExecutorService.java:134)
	at org.apache.catalina.core.ContainerBase.startInternal(ContainerBase.java:943)
	at org.apache.catalina.core.StandardEngine.startInternal(StandardEngine.java:258)
	at org.apache.catalina.util.LifecycleBase.start(LifecycleBase.java:183)
	at org.apache.catalina.core.StandardService.startInternal(StandardService.java:422)
	at org.apache.catalina.util.LifecycleBase.start(LifecycleBase.java:183)
	at org.apache.catalina.core.StandardServer.startInternal(StandardServer.java:770)
	at org.apache.catalina.util.LifecycleBase.start(LifecycleBase.java:183)
	at org.apache.catalina.startup.Tomcat.start(Tomcat.java:371)
	at org.apache.catalina.startup.TomcatBaseTest$TomcatWithFastSessionIDs.start(TomcatBaseTest.java:836)
	at org.apache.catalina.core.TestStandardContext.testFlagFailCtxIfServletStartFails(TestStandardContext.java:884)
	at sun.reflect.NativeMethodAccessorImpl.invoke0(Native Method)
	at sun.reflect.NativeMethodAccessorImpl.invoke(NativeMethodAccessorImpl.java:62)
	at sun.reflect.DelegatingMethodAccessorImpl.invoke(DelegatingMethodAccessorImpl.java:43)
	at java.lang.reflect.Method.invoke(Method.java:498)
	at org.junit.runners.model.FrameworkMethod$1.runReflectiveCall(FrameworkMethod.java:59)
	at org.junit.internal.runners.model.ReflectiveCallable.run(ReflectiveCallable.java:12)
	at org.junit.runners.model.FrameworkMethod.invokeExplosively(FrameworkMethod.java:61)
	at org.junit.internal.runners.statements.InvokeMethod.evaluate(InvokeMethod.java:17)
	at org.junit.internal.runners.statements.RunBefores.evaluate(RunBefores.java:26)
	at org.junit.internal.runners.statements.RunAfters.evaluate(RunAfters.java:27)
	at org.junit.rules.TestWatcher$1.evaluate(TestWatcher.java:55)
	at org.junit.runners.BlockJUnit4ClassRunner$1.evaluate(BlockJUnit4ClassRunner.java:100)
	at org.junit.runners.ParentRunner.runLeaf(ParentRunner.java:346)
	at org.junit.runners.BlockJUnit4ClassRunner.runChild(BlockJUnit4ClassRunner.java:103)
	at org.junit.runners.BlockJUnit4ClassRunner.runChild(BlockJUnit4ClassRunner.java:63)
	at org.junit.runners.ParentRunner$3.run(ParentRunner.java:311)
	at org.junit.runners.ParentRunner$1.schedule(ParentRunner.java:76)
	at org.junit.runners.ParentRunner.runChildren(ParentRunner.java:309)
	at org.junit.runners.ParentRunner.access$100(ParentRunner.java:63)
	at org.junit.runners.ParentRunner$2.evaluate(ParentRunner.java:289)
	at org.junit.internal.runners.statements.RunBefores.evaluate(RunBefores.java:26)
	at org.junit.internal.runners.statements.RunAfters.evaluate(RunAfters.java:27)
	at org.junit.runners.ParentRunner.run(ParentRunner.java:393)
	at junit.framework.JUnit4TestAdapter.run(JUnit4TestAdapter.java:48)
	at org.apache.tools.ant.taskdefs.optional.junit.JUnitTestRunner.run(JUnitTestRunner.java:536)
	at org.apache.tools.ant.taskdefs.optional.junit.JUnitTestRunner.launch(JUnitTestRunner.java:1205)
	at org.apache.tools.ant.taskdefs.optional.junit.JUnitTestRunner.main(JUnitTestRunner.java:1048)

23-Feb-2018 10:49:13.605 INFO [main] org.apache.coyote.AbstractProtocol.start Starting ProtocolHandler ["http-apr-127.0.0.1-auto-18-47693"]
23-Feb-2018 10:49:13.608 INFO [main] org.apache.coyote.AbstractProtocol.pause Pausing ProtocolHandler ["http-apr-127.0.0.1-auto-18-47693"]
23-Feb-2018 10:49:13.661 INFO [main] org.apache.catalina.core.StandardService.stopInternal Stopping service [Tomcat]
23-Feb-2018 10:49:13.662 INFO [main] org.apache.coyote.AbstractProtocol.stop Stopping ProtocolHandler ["http-apr-127.0.0.1-auto-18-47693"]
23-Feb-2018 10:49:13.716 INFO [main] org.apache.catalina.core.StandardService.startInternal Starting service [Tomcat]
23-Feb-2018 10:49:13.717 INFO [main] org.apache.catalina.core.StandardEngine.startInternal Starting Servlet Engine: Apache Tomcat/9.0.6-dev
23-Feb-2018 10:49:13.723 SEVERE [main] org.apache.catalina.core.StandardContext.loadOnStartup Servlet [myservlet] in web application [] threw load() exception
 javax.servlet.ServletException: failing on purpose
	at org.apache.catalina.core.TestStandardContext$FailingStartupServlet.init(TestStandardContext.java:908)
	at javax.servlet.GenericServlet.init(GenericServlet.java:158)
	at org.apache.catalina.startup.Tomcat$ExistingStandardWrapper.loadServlet(Tomcat.java:1042)
	at org.apache.catalina.core.StandardWrapper.load(StandardWrapper.java:971)
	at org.apache.catalina.core.StandardContext.loadOnStartup(StandardContext.java:4765)
	at org.apache.catalina.core.StandardContext.startInternal(StandardContext.java:5075)
	at org.apache.catalina.util.LifecycleBase.start(LifecycleBase.java:183)
	at org.apache.catalina.core.ContainerBase$StartChild.call(ContainerBase.java:1427)
	at org.apache.catalina.core.ContainerBase$StartChild.call(ContainerBase.java:1417)
	at java.util.concurrent.FutureTask.run(FutureTask.java:266)
	at org.apache.tomcat.util.threads.InlineExecutorService.execute(InlineExecutorService.java:75)
	at java.util.concurrent.AbstractExecutorService.submit(AbstractExecutorService.java:134)
	at org.apache.catalina.core.ContainerBase.startInternal(ContainerBase.java:943)
	at org.apache.catalina.core.StandardHost.startInternal(StandardHost.java:839)
	at org.apache.catalina.util.LifecycleBase.start(LifecycleBase.java:183)
	at org.apache.catalina.core.ContainerBase$StartChild.call(ContainerBase.java:1427)
	at org.apache.catalina.core.ContainerBase$StartChild.call(ContainerBase.java:1417)
	at java.util.concurrent.FutureTask.run(FutureTask.java:266)
	at org.apache.tomcat.util.threads.InlineExecutorService.execute(InlineExecutorService.java:75)
	at java.util.concurrent.AbstractExecutorService.submit(AbstractExecutorService.java:134)
	at org.apache.catalina.core.ContainerBase.startInternal(ContainerBase.java:943)
	at org.apache.catalina.core.StandardEngine.startInternal(StandardEngine.java:258)
	at org.apache.catalina.util.LifecycleBase.start(LifecycleBase.java:183)
	at org.apache.catalina.core.StandardService.startInternal(StandardService.java:422)
	at org.apache.catalina.util.LifecycleBase.start(LifecycleBase.java:183)
	at org.apache.catalina.core.StandardServer.startInternal(StandardServer.java:770)
	at org.apache.catalina.util.LifecycleBase.start(LifecycleBase.java:183)
	at org.apache.catalina.startup.Tomcat.start(Tomcat.java:371)
	at org.apache.catalina.startup.TomcatBaseTest$TomcatWithFastSessionIDs.start(TomcatBaseTest.java:836)
	at org.apache.catalina.core.TestStandardContext.testFlagFailCtxIfServletStartFails(TestStandardContext.java:897)
	at sun.reflect.NativeMethodAccessorImpl.invoke0(Native Method)
	at sun.reflect.NativeMethodAccessorImpl.invoke(NativeMethodAccessorImpl.java:62)
	at sun.reflect.DelegatingMethodAccessorImpl.invoke(DelegatingMethodAccessorImpl.java:43)
	at java.lang.reflect.Method.invoke(Method.java:498)
	at org.junit.runners.model.FrameworkMethod$1.runReflectiveCall(FrameworkMethod.java:59)
	at org.junit.internal.runners.model.ReflectiveCallable.run(ReflectiveCallable.java:12)
	at org.junit.runners.model.FrameworkMethod.invokeExplosively(FrameworkMethod.java:61)
	at org.junit.internal.runners.statements.InvokeMethod.evaluate(InvokeMethod.java:17)
	at org.junit.internal.runners.statements.RunBefores.evaluate(RunBefores.java:26)
	at org.junit.internal.runners.statements.RunAfters.evaluate(RunAfters.java:27)
	at org.junit.rules.TestWatcher$1.evaluate(TestWatcher.java:55)
	at org.junit.runners.BlockJUnit4ClassRunner$1.evaluate(BlockJUnit4ClassRunner.java:100)
	at org.junit.runners.ParentRunner.runLeaf(ParentRunner.java:346)
	at org.junit.runners.BlockJUnit4ClassRunner.runChild(BlockJUnit4ClassRunner.java:103)
	at org.junit.runners.BlockJUnit4ClassRunner.runChild(BlockJUnit4ClassRunner.java:63)
	at org.junit.runners.ParentRunner$3.run(ParentRunner.java:311)
	at org.junit.runners.ParentRunner$1.schedule(ParentRunner.java:76)
	at org.junit.runners.ParentRunner.runChildren(ParentRunner.java:309)
	at org.junit.runners.ParentRunner.access$100(ParentRunner.java:63)
	at org.junit.runners.ParentRunner$2.evaluate(ParentRunner.java:289)
	at org.junit.internal.runners.statements.RunBefores.evaluate(RunBefores.java:26)
	at org.junit.internal.runners.statements.RunAfters.evaluate(RunAfters.java:27)
	at org.junit.runners.ParentRunner.run(ParentRunner.java:393)
	at junit.framework.JUnit4TestAdapter.run(JUnit4TestAdapter.java:48)
	at org.apache.tools.ant.taskdefs.optional.junit.JUnitTestRunner.run(JUnitTestRunner.java:536)
	at org.apache.tools.ant.taskdefs.optional.junit.JUnitTestRunner.launch(JUnitTestRunner.java:1205)
	at org.apache.tools.ant.taskdefs.optional.junit.JUnitTestRunner.main(JUnitTestRunner.java:1048)

23-Feb-2018 10:49:13.725 SEVERE [main] org.apache.catalina.core.StandardContext.startInternal One or more Servlets failed to load on startup. Full details will be found in the appropriate container log file
23-Feb-2018 10:49:13.725 SEVERE [main] org.apache.catalina.core.StandardContext.startInternal Context [] startup failed due to previous errors
23-Feb-2018 10:49:13.729 INFO [main] org.apache.coyote.AbstractProtocol.start Starting ProtocolHandler ["http-apr-127.0.0.1-auto-18-47693"]
23-Feb-2018 10:49:13.736 INFO [main] org.apache.coyote.AbstractProtocol.pause Pausing ProtocolHandler ["http-apr-127.0.0.1-auto-18-47693"]
23-Feb-2018 10:49:13.787 INFO [main] org.apache.catalina.core.StandardService.stopInternal Stopping service [Tomcat]
23-Feb-2018 10:49:13.787 INFO [main] org.apache.coyote.AbstractProtocol.stop Stopping ProtocolHandler ["http-apr-127.0.0.1-auto-18-47693"]
23-Feb-2018 10:49:13.838 INFO [main] org.apache.coyote.AbstractProtocol.destroy Destroying ProtocolHandler ["http-apr-127.0.0.1-auto-18-47693"]
23-Feb-2018 10:49:13.840 INFO [main] org.apache.catalina.startup.LoggingBaseTest.setUp Starting test case [testAddPreDestroyMethodNullClassName]
23-Feb-2018 10:49:13.841 INFO [main] org.apache.coyote.AbstractProtocol.destroy Destroying ProtocolHandler ["http-apr-127.0.0.1-auto-19"]
23-Feb-2018 10:49:13.842 INFO [main] org.apache.catalina.startup.LoggingBaseTest.setUp Starting test case [testAddPreDestroyMethodNullMethodName]
23-Feb-2018 10:49:13.843 INFO [main] org.apache.coyote.AbstractProtocol.destroy Destroying ProtocolHandler ["http-apr-127.0.0.1-auto-20"]
23-Feb-2018 10:49:13.844 INFO [main] org.apache.catalina.startup.LoggingBaseTest.setUp Starting test case [testAddPostConstructMethodNullMethodName]
23-Feb-2018 10:49:13.845 INFO [main] org.apache.coyote.AbstractProtocol.destroy Destroying ProtocolHandler ["http-apr-127.0.0.1-auto-21"]
23-Feb-2018 10:49:13.845 INFO [main] org.apache.catalina.startup.LoggingBaseTest.setUp Starting test case [testSetPath]
23-Feb-2018 10:49:13.847 WARNING [main] org.apache.catalina.core.StandardContext.setPath A context path must either be an empty string or start with a '/' and do not end with a '/'. The path [null] does not meet these criteria and has been changed to []
23-Feb-2018 10:49:13.847 WARNING [main] org.apache.catalina.core.StandardContext.setPath A context path must either be an empty string or start with a '/' and do not end with a '/'. The path [/] does not meet these criteria and has been changed to []
23-Feb-2018 10:49:13.847 WARNING [main] org.apache.catalina.core.StandardContext.setPath A context path must either be an empty string or start with a '/' and do not end with a '/'. The path [foo] does not meet these criteria and has been changed to [/foo]
23-Feb-2018 10:49:13.847 WARNING [main] org.apache.catalina.core.StandardContext.setPath A context path must either be an empty string or start with a '/' and do not end with a '/'. The path [/foo/bar/] does not meet these criteria and has been changed to [/foo/bar]
23-Feb-2018 10:49:13.847 WARNING [main] org.apache.catalina.core.StandardContext.setPath A context path must either be an empty string or start with a '/' and do not end with a '/'. The path [foo/bar/] does not meet these criteria and has been changed to [/foo/bar]
23-Feb-2018 10:49:13.847 INFO [main] org.apache.coyote.AbstractProtocol.destroy Destroying ProtocolHandler ["http-apr-127.0.0.1-auto-22"]
23-Feb-2018 10:49:13.848 INFO [main] org.apache.catalina.startup.LoggingBaseTest.setUp Starting test case [testAddPostConstructMethodConflicts]
23-Feb-2018 10:49:13.849 INFO [main] org.apache.coyote.AbstractProtocol.destroy Destroying ProtocolHandler ["http-apr-127.0.0.1-auto-23"]
23-Feb-2018 10:49:13.849 INFO [main] org.apache.catalina.startup.LoggingBaseTest.setUp Starting test case [testDenyUncoveredHttpMethodsSCIFalse]
23-Feb-2018 10:49:13.850 INFO [main] org.apache.catalina.core.AprLifecycleListener.lifecycleEvent Loaded APR based Apache Tomcat Native library [1.2.17] using APR version [1.6.4].
23-Feb-2018 10:49:13.850 INFO [main] org.apache.catalina.core.AprLifecycleListener.lifecycleEvent APR capabilities: IPv6 [true], sendfile [true], accept filters [false], random [true].
23-Feb-2018 10:49:13.850 INFO [main] org.apache.catalina.core.AprLifecycleListener.lifecycleEvent APR/OpenSSL configuration: useAprConnector [false], useOpenSSL [true]
23-Feb-2018 10:49:13.850 INFO [main] org.apache.catalina.core.AprLifecycleListener.lifecycleEvent Loaded APR based Apache Tomcat Native library [1.2.17] using APR version [1.6.4].
23-Feb-2018 10:49:13.850 INFO [main] org.apache.catalina.core.AprLifecycleListener.lifecycleEvent APR capabilities: IPv6 [true], sendfile [true], accept filters [false], random [true].
23-Feb-2018 10:49:13.850 INFO [main] org.apache.catalina.core.AprLifecycleListener.lifecycleEvent APR/OpenSSL configuration: useAprConnector [false], useOpenSSL [true]
23-Feb-2018 10:49:13.850 INFO [main] org.apache.catalina.core.AprLifecycleListener.lifecycleEvent Loaded APR based Apache Tomcat Native library [1.2.17] using APR version [1.6.4].
23-Feb-2018 10:49:13.851 INFO [main] org.apache.catalina.core.AprLifecycleListener.lifecycleEvent APR capabilities: IPv6 [true], sendfile [true], accept filters [false], random [true].
23-Feb-2018 10:49:13.851 INFO [main] org.apache.catalina.core.AprLifecycleListener.lifecycleEvent APR/OpenSSL configuration: useAprConnector [false], useOpenSSL [true]
23-Feb-2018 10:49:13.857 INFO [main] org.apache.catalina.core.AprLifecycleListener.lifecycleEvent Loaded APR based Apache Tomcat Native library [1.2.17] using APR version [1.6.4].
23-Feb-2018 10:49:13.857 INFO [main] org.apache.catalina.core.AprLifecycleListener.lifecycleEvent APR capabilities: IPv6 [true], sendfile [true], accept filters [false], random [true].
23-Feb-2018 10:49:13.857 INFO [main] org.apache.catalina.core.AprLifecycleListener.lifecycleEvent APR/OpenSSL configuration: useAprConnector [false], useOpenSSL [true]
23-Feb-2018 10:49:13.857 INFO [main] org.apache.catalina.core.AprLifecycleListener.lifecycleEvent Loaded APR based Apache Tomcat Native library [1.2.17] using APR version [1.6.4].
23-Feb-2018 10:49:13.857 INFO [main] org.apache.catalina.core.AprLifecycleListener.lifecycleEvent APR capabilities: IPv6 [true], sendfile [true], accept filters [false], random [true].
23-Feb-2018 10:49:13.857 INFO [main] org.apache.catalina.core.AprLifecycleListener.lifecycleEvent APR/OpenSSL configuration: useAprConnector [false], useOpenSSL [true]
23-Feb-2018 10:49:13.857 INFO [main] org.apache.catalina.core.AprLifecycleListener.lifecycleEvent Loaded APR based Apache Tomcat Native library [1.2.17] using APR version [1.6.4].
23-Feb-2018 10:49:13.857 INFO [main] org.apache.catalina.core.AprLifecycleListener.lifecycleEvent APR capabilities: IPv6 [true], sendfile [true], accept filters [false], random [true].
23-Feb-2018 10:49:13.858 INFO [main] org.apache.catalina.core.AprLifecycleListener.lifecycleEvent APR/OpenSSL configuration: useAprConnector [false], useOpenSSL [true]
23-Feb-2018 10:49:13.858 INFO [main] org.apache.catalina.core.AprLifecycleListener.initializeSSL OpenSSL successfully initialized [OpenSSL 1.1.1-pre2-dev  xx XXX xxxx]
23-Feb-2018 10:49:13.860 INFO [main] org.apache.coyote.AbstractProtocol.init Initializing ProtocolHandler ["http-apr-127.0.0.1-auto-24"]
23-Feb-2018 10:49:13.860 INFO [main] org.apache.catalina.core.StandardService.startInternal Starting service [Tomcat]
23-Feb-2018 10:49:13.860 INFO [main] org.apache.catalina.core.StandardEngine.startInternal Starting Servlet Engine: Apache Tomcat/9.0.6-dev
23-Feb-2018 10:49:13.868 SEVERE [main] org.apache.tomcat.util.descriptor.web.SecurityConstraint.findUncoveredHttpMethods For security constraints with URL pattern [/test] only the HTTP methods [POST] are covered. All other methods are uncovered.
23-Feb-2018 10:49:13.871 INFO [main] org.apache.coyote.AbstractProtocol.start Starting ProtocolHandler ["http-apr-127.0.0.1-auto-24-57823"]

Continuation...

23-Feb-2018 10:49:13.887 INFO [main] org.apache.coyote.AbstractProtocol.pause Pausing ProtocolHandler ["http-apr-127.0.0.1-auto-24-57823"]
23-Feb-2018 10:49:13.938 INFO [main] org.apache.catalina.core.StandardService.stopInternal Stopping service [Tomcat]
23-Feb-2018 10:49:13.942 INFO [main] org.apache.coyote.AbstractProtocol.stop Stopping ProtocolHandler ["http-apr-127.0.0.1-auto-24-57823"]
23-Feb-2018 10:49:13.995 INFO [main] org.apache.coyote.AbstractProtocol.destroy Destroying ProtocolHandler ["http-apr-127.0.0.1-auto-24-57823"]
------------- ---------------- ---------------

Testcase: testTldListener took 1.063 sec
Testcase: testWebappListenerConfigureFail took 1.726 sec
Testcase: testDenyUncoveredHttpMethodsSCITrue took 0.165 sec
Testcase: testAddPostConstructMethodNullClassName took 0.01 sec
Testcase: testAddPreDestroyMethodConflicts took 0.004 sec
Testcase: testBug46243 took 0.173 sec
Testcase: testBug49711 took 0.216 sec
Testcase: testBug49922 took 0.428 sec
Testcase: testBug50015 took 0.155 sec
Testcase: testBug56085 took 0.459 sec
Testcase: testBug56903 took 0.016 sec
Testcase: testWebappLoaderStartFail took 0.375 sec
Testcase: testUncoveredMethods took 0.16 sec
Testcase: testBug51376a took 0.13 sec
Testcase: testBug51376b took 0.12 sec
Testcase: testBug57556a took 0.32 sec
Testcase: testBug57556b took 0.131 sec
Testcase: testFlagFailCtxIfServletStartFails took 0.267 sec
Testcase: testAddPreDestroyMethodNullClassName took 0.002 sec
Testcase: testAddPreDestroyMethodNullMethodName took 0.001 sec
Testcase: testAddPostConstructMethodNullMethodName took 0.002 sec
Testcase: testSetPath took 0.003 sec
Testcase: testAddPostConstructMethodConflicts took 0.001 sec
Testcase: testDenyUncoveredHttpMethodsSCIFalse took 0.148 sec

Apache Gump, Gump, Apache, the Apache feather logo, and the Apache Gump project logos are trademarks of The Apache Software Foundation.

Last Updated: Fri, 23 Feb 2018 06:00:07 ().Python Logo