Run| Workspace| Log| Issues| Fixes| Pre-reqs| Stats| XRef| Maven Repository Proxy Log Gump Logo

Details

File Contents

Testsuite: org.apache.catalina.connector.TestResponse
Tests run: 77, Failures: 0, Errors: 0, Skipped: 0, Time elapsed: 0.95 sec
------------- Standard Error -----------------
26-Oct-2021 10:21:23.500 INFO [main] org.apache.catalina.startup.LoggingBaseTest.setUp Starting test case [testSendRedirect01]
26-Oct-2021 10:21:23.607 INFO [main] org.apache.coyote.AbstractProtocol.destroy Destroying ProtocolHandler ["http-nio2-127.0.0.1-auto-1"]
26-Oct-2021 10:21:23.613 INFO [main] org.apache.catalina.startup.LoggingBaseTest.setUp Starting test case [testSendRedirect02]
26-Oct-2021 10:21:23.614 INFO [main] org.apache.coyote.AbstractProtocol.destroy Destroying ProtocolHandler ["http-nio2-127.0.0.1-auto-2"]
26-Oct-2021 10:21:23.615 INFO [main] org.apache.catalina.startup.LoggingBaseTest.setUp Starting test case [testSendRedirect03]
26-Oct-2021 10:21:23.616 INFO [main] org.apache.coyote.AbstractProtocol.destroy Destroying ProtocolHandler ["http-nio2-127.0.0.1-auto-3"]
26-Oct-2021 10:21:23.616 INFO [main] org.apache.catalina.startup.LoggingBaseTest.setUp Starting test case [testSetLocale01]
26-Oct-2021 10:21:23.621 INFO [main] org.apache.coyote.AbstractProtocol.destroy Destroying ProtocolHandler ["http-nio2-127.0.0.1-auto-4"]
26-Oct-2021 10:21:23.621 INFO [main] org.apache.catalina.startup.LoggingBaseTest.setUp Starting test case [testSetLocale02]
26-Oct-2021 10:21:23.623 INFO [main] org.apache.coyote.AbstractProtocol.destroy Destroying ProtocolHandler ["http-nio2-127.0.0.1-auto-5"]
26-Oct-2021 10:21:23.623 INFO [main] org.apache.catalina.startup.LoggingBaseTest.setUp Starting test case [testSetLocale03]
26-Oct-2021 10:21:23.624 INFO [main] org.apache.coyote.AbstractProtocol.destroy Destroying ProtocolHandler ["http-nio2-127.0.0.1-auto-6"]
26-Oct-2021 10:21:23.625 INFO [main] org.apache.catalina.startup.LoggingBaseTest.setUp Starting test case [testSetLocale04]
26-Oct-2021 10:21:23.626 INFO [main] org.apache.coyote.AbstractProtocol.destroy Destroying ProtocolHandler ["http-nio2-127.0.0.1-auto-7"]
26-Oct-2021 10:21:23.626 INFO [main] org.apache.catalina.startup.LoggingBaseTest.setUp Starting test case [testSetLocale05]
26-Oct-2021 10:21:23.627 WARNING [main] org.apache.catalina.connector.Response.setLocale The encoding [unknown] is not recognised by the JRE
	java.lang.IllegalArgumentException: java.io.UnsupportedEncodingException: The character encoding [unknown] is not supported
		at org.apache.coyote.Response.setCharacterEncoding(Response.java:485)
		at org.apache.catalina.connector.Response.setLocale(Response.java:880)
		at org.apache.catalina.connector.TestResponse.testSetLocale05(TestResponse.java:894)
		at java.base/jdk.internal.reflect.NativeMethodAccessorImpl.invoke0(Native Method)
		at java.base/jdk.internal.reflect.NativeMethodAccessorImpl.invoke(NativeMethodAccessorImpl.java:62)
		at java.base/jdk.internal.reflect.DelegatingMethodAccessorImpl.invoke(DelegatingMethodAccessorImpl.java:43)
		at java.base/java.lang.reflect.Method.invoke(Method.java:566)
		at org.junit.runners.model.FrameworkMethod$1.runReflectiveCall(FrameworkMethod.java:59)
		at org.junit.internal.runners.model.ReflectiveCallable.run(ReflectiveCallable.java:12)
		at org.junit.runners.model.FrameworkMethod.invokeExplosively(FrameworkMethod.java:61)
		at org.junit.internal.runners.statements.InvokeMethod.evaluate(InvokeMethod.java:17)
		at org.junit.internal.runners.statements.ExpectException.evaluate(ExpectException.java:19)
		at org.junit.internal.runners.statements.RunBefores.evaluate(RunBefores.java:26)
		at org.junit.internal.runners.statements.RunAfters.evaluate(RunAfters.java:27)
		at org.junit.rules.TestWatcher$1.evaluate(TestWatcher.java:61)
		at org.junit.runners.ParentRunner$3.evaluate(ParentRunner.java:306)
		at org.junit.runners.BlockJUnit4ClassRunner$1.evaluate(BlockJUnit4ClassRunner.java:100)
		at org.junit.runners.ParentRunner.runLeaf(ParentRunner.java:366)
		at org.junit.runners.BlockJUnit4ClassRunner.runChild(BlockJUnit4ClassRunner.java:103)
		at org.junit.runners.BlockJUnit4ClassRunner.runChild(BlockJUnit4ClassRunner.java:63)
		at org.junit.runners.ParentRunner$4.run(ParentRunner.java:331)
		at org.junit.runners.ParentRunner$1.schedule(ParentRunner.java:79)
		at org.junit.runners.ParentRunner.runChildren(ParentRunner.java:329)
		at org.junit.runners.ParentRunner.access$100(ParentRunner.java:66)
		at org.junit.runners.ParentRunner$2.evaluate(ParentRunner.java:293)
		at org.junit.internal.runners.statements.RunBefores.evaluate(RunBefores.java:26)
		at org.junit.internal.runners.statements.RunAfters.evaluate(RunAfters.java:27)
		at org.junit.runners.ParentRunner$3.evaluate(ParentRunner.java:306)
		at org.junit.runners.ParentRunner.run(ParentRunner.java:413)
		at junit.framework.JUnit4TestAdapter.run(JUnit4TestAdapter.java:50)
		at org.apache.tools.ant.taskdefs.optional.junit.JUnitTestRunner.run(JUnitTestRunner.java:535)
		at org.apache.tools.ant.taskdefs.optional.junit.JUnitTestRunner.launch(JUnitTestRunner.java:1197)
		at org.apache.tools.ant.taskdefs.optional.junit.JUnitTestRunner.main(JUnitTestRunner.java:1042)
	Caused by: java.io.UnsupportedEncodingException: The character encoding [unknown] is not supported
		at org.apache.tomcat.util.buf.B2CConverter.getCharsetLower(B2CConverter.java:87)
		at org.apache.tomcat.util.buf.B2CConverter.getCharset(B2CConverter.java:62)
		at org.apache.coyote.Response.setCharacterEncoding(Response.java:483)
		... 32 more
26-Oct-2021 10:21:23.629 WARNING [main] org.apache.catalina.connector.Response.setCharacterEncoding The encoding [unknown] is not recognised by the JRE
	java.lang.IllegalArgumentException: java.io.UnsupportedEncodingException: The character encoding [unknown] is not supported
		at org.apache.coyote.Response.setCharacterEncoding(Response.java:485)
		at org.apache.catalina.connector.Response.setCharacterEncoding(Response.java:823)
		at org.apache.catalina.connector.Response.getWriter(Response.java:603)
		at org.apache.catalina.connector.TestResponse.testSetLocale05(TestResponse.java:896)
		at java.base/jdk.internal.reflect.NativeMethodAccessorImpl.invoke0(Native Method)
		at java.base/jdk.internal.reflect.NativeMethodAccessorImpl.invoke(NativeMethodAccessorImpl.java:62)
		at java.base/jdk.internal.reflect.DelegatingMethodAccessorImpl.invoke(DelegatingMethodAccessorImpl.java:43)
		at java.base/java.lang.reflect.Method.invoke(Method.java:566)
		at org.junit.runners.model.FrameworkMethod$1.runReflectiveCall(FrameworkMethod.java:59)
		at org.junit.internal.runners.model.ReflectiveCallable.run(ReflectiveCallable.java:12)
		at org.junit.runners.model.FrameworkMethod.invokeExplosively(FrameworkMethod.java:61)
		at org.junit.internal.runners.statements.InvokeMethod.evaluate(InvokeMethod.java:17)
		at org.junit.internal.runners.statements.ExpectException.evaluate(ExpectException.java:19)
		at org.junit.internal.runners.statements.RunBefores.evaluate(RunBefores.java:26)
		at org.junit.internal.runners.statements.RunAfters.evaluate(RunAfters.java:27)
		at org.junit.rules.TestWatcher$1.evaluate(TestWatcher.java:61)
		at org.junit.runners.ParentRunner$3.evaluate(ParentRunner.java:306)
		at org.junit.runners.BlockJUnit4ClassRunner$1.evaluate(BlockJUnit4ClassRunner.java:100)
		at org.junit.runners.ParentRunner.runLeaf(ParentRunner.java:366)
		at org.junit.runners.BlockJUnit4ClassRunner.runChild(BlockJUnit4ClassRunner.java:103)
		at org.junit.runners.BlockJUnit4ClassRunner.runChild(BlockJUnit4ClassRunner.java:63)
		at org.junit.runners.ParentRunner$4.run(ParentRunner.java:331)
		at org.junit.runners.ParentRunner$1.schedule(ParentRunner.java:79)
		at org.junit.runners.ParentRunner.runChildren(ParentRunner.java:329)
		at org.junit.runners.ParentRunner.access$100(ParentRunner.java:66)
		at org.junit.runners.ParentRunner$2.evaluate(ParentRunner.java:293)
		at org.junit.internal.runners.statements.RunBefores.evaluate(RunBefores.java:26)
		at org.junit.internal.runners.statements.RunAfters.evaluate(RunAfters.java:27)
		at org.junit.runners.ParentRunner$3.evaluate(ParentRunner.java:306)
		at org.junit.runners.ParentRunner.run(ParentRunner.java:413)
		at junit.framework.JUnit4TestAdapter.run(JUnit4TestAdapter.java:50)
		at org.apache.tools.ant.taskdefs.optional.junit.JUnitTestRunner.run(JUnitTestRunner.java:535)
		at org.apache.tools.ant.taskdefs.optional.junit.JUnitTestRunner.launch(JUnitTestRunner.java:1197)
		at org.apache.tools.ant.taskdefs.optional.junit.JUnitTestRunner.main(JUnitTestRunner.java:1042)
	Caused by: java.io.UnsupportedEncodingException: The character encoding [unknown] is not supported
		at org.apache.tomcat.util.buf.B2CConverter.getCharsetLower(B2CConverter.java:87)
		at org.apache.tomcat.util.buf.B2CConverter.getCharset(B2CConverter.java:62)
		at org.apache.coyote.Response.setCharacterEncoding(Response.java:483)
		... 33 more
26-Oct-2021 10:21:23.633 INFO [main] org.apache.coyote.AbstractProtocol.destroy Destroying ProtocolHandler ["http-nio2-127.0.0.1-auto-8"]
26-Oct-2021 10:21:23.634 INFO [main] org.apache.catalina.startup.LoggingBaseTest.setUp Starting test case [testSetLocale06]
26-Oct-2021 10:21:23.635 WARNING [main] org.apache.catalina.connector.Response.setLocale The encoding [unknown] is not recognised by the JRE
	java.lang.IllegalArgumentException: java.io.UnsupportedEncodingException: The character encoding [unknown] is not supported
		at org.apache.coyote.Response.setCharacterEncoding(Response.java:485)
		at org.apache.catalina.connector.Response.setLocale(Response.java:880)
		at org.apache.catalina.connector.TestResponse.testSetLocale06(TestResponse.java:906)
		at java.base/jdk.internal.reflect.NativeMethodAccessorImpl.invoke0(Native Method)
		at java.base/jdk.internal.reflect.NativeMethodAccessorImpl.invoke(NativeMethodAccessorImpl.java:62)
		at java.base/jdk.internal.reflect.DelegatingMethodAccessorImpl.invoke(DelegatingMethodAccessorImpl.java:43)
		at java.base/java.lang.reflect.Method.invoke(Method.java:566)
		at org.junit.runners.model.FrameworkMethod$1.runReflectiveCall(FrameworkMethod.java:59)
		at org.junit.internal.runners.model.ReflectiveCallable.run(ReflectiveCallable.java:12)
		at org.junit.runners.model.FrameworkMethod.invokeExplosively(FrameworkMethod.java:61)
		at org.junit.internal.runners.statements.InvokeMethod.evaluate(InvokeMethod.java:17)
		at org.junit.internal.runners.statements.RunBefores.evaluate(RunBefores.java:26)
		at org.junit.internal.runners.statements.RunAfters.evaluate(RunAfters.java:27)
		at org.junit.rules.TestWatcher$1.evaluate(TestWatcher.java:61)
		at org.junit.runners.ParentRunner$3.evaluate(ParentRunner.java:306)
		at org.junit.runners.BlockJUnit4ClassRunner$1.evaluate(BlockJUnit4ClassRunner.java:100)
		at org.junit.runners.ParentRunner.runLeaf(ParentRunner.java:366)
		at org.junit.runners.BlockJUnit4ClassRunner.runChild(BlockJUnit4ClassRunner.java:103)
		at org.junit.runners.BlockJUnit4ClassRunner.runChild(BlockJUnit4ClassRunner.java:63)
		at org.junit.runners.ParentRunner$4.run(ParentRunner.java:331)
		at org.junit.runners.ParentRunner$1.schedule(ParentRunner.java:79)
		at org.junit.runners.ParentRunner.runChildren(ParentRunner.java:329)
		at org.junit.runners.ParentRunner.access$100(ParentRunner.java:66)
		at org.junit.runners.ParentRunner$2.evaluate(ParentRunner.java:293)
		at org.junit.internal.runners.statements.RunBefores.evaluate(RunBefores.java:26)
		at org.junit.internal.runners.statements.RunAfters.evaluate(RunAfters.java:27)
		at org.junit.runners.ParentRunner$3.evaluate(ParentRunner.java:306)
		at org.junit.runners.ParentRunner.run(ParentRunner.java:413)
		at junit.framework.JUnit4TestAdapter.run(JUnit4TestAdapter.java:50)
		at org.apache.tools.ant.taskdefs.optional.junit.JUnitTestRunner.run(JUnitTestRunner.java:535)
		at org.apache.tools.ant.taskdefs.optional.junit.JUnitTestRunner.launch(JUnitTestRunner.java:1197)
		at org.apache.tools.ant.taskdefs.optional.junit.JUnitTestRunner.main(JUnitTestRunner.java:1042)
	Caused by: java.io.UnsupportedEncodingException: The character encoding [unknown] is not supported
		at org.apache.tomcat.util.buf.B2CConverter.getCharsetLower(B2CConverter.java:87)
		at org.apache.tomcat.util.buf.B2CConverter.getCharset(B2CConverter.java:62)
		at org.apache.coyote.Response.setCharacterEncoding(Response.java:483)
		... 31 more
26-Oct-2021 10:21:23.636 INFO [main] org.apache.coyote.AbstractProtocol.destroy Destroying ProtocolHandler ["http-nio2-127.0.0.1-auto-9"]
26-Oct-2021 10:21:23.637 INFO [main] org.apache.catalina.startup.LoggingBaseTest.setUp Starting test case [testSetLocale07]
26-Oct-2021 10:21:23.638 INFO [main] org.apache.coyote.AbstractProtocol.destroy Destroying ProtocolHandler ["http-nio2-127.0.0.1-auto-10"]
26-Oct-2021 10:21:23.638 INFO [main] org.apache.catalina.startup.LoggingBaseTest.setUp Starting test case [testSetLocale08]
26-Oct-2021 10:21:23.643 INFO [main] org.apache.coyote.AbstractProtocol.destroy Destroying ProtocolHandler ["http-nio2-127.0.0.1-auto-11"]
26-Oct-2021 10:21:23.644 INFO [main] org.apache.catalina.startup.LoggingBaseTest.setUp Starting test case [testBug49598]
26-Oct-2021 10:21:23.918 INFO [main] org.apache.coyote.AbstractProtocol.init Initializing ProtocolHandler ["http-nio2-127.0.0.1-auto-12"]
26-Oct-2021 10:21:23.941 INFO [main] org.apache.catalina.core.StandardService.startInternal Starting service [Tomcat]
26-Oct-2021 10:21:23.942 INFO [main] org.apache.catalina.core.StandardEngine.startInternal Starting Servlet engine: [Apache Tomcat/8.5.72-dev]
26-Oct-2021 10:21:24.019 INFO [main] org.apache.coyote.AbstractProtocol.start Starting ProtocolHandler ["http-nio2-127.0.0.1-auto-12-35621"]
26-Oct-2021 10:21:24.077 INFO [main] org.apache.coyote.AbstractProtocol.pause Pausing ProtocolHandler ["http-nio2-127.0.0.1-auto-12-35621"]
26-Oct-2021 10:21:24.083 INFO [main] org.apache.catalina.core.StandardService.stopInternal Stopping service [Tomcat]
26-Oct-2021 10:21:24.100 INFO [main] org.apache.coyote.AbstractProtocol.stop Stopping ProtocolHandler ["http-nio2-127.0.0.1-auto-12-35621"]
26-Oct-2021 10:21:24.104 INFO [main] org.apache.coyote.AbstractProtocol.destroy Destroying ProtocolHandler ["http-nio2-127.0.0.1-auto-12-35621"]
26-Oct-2021 10:21:24.119 INFO [main] org.apache.catalina.startup.LoggingBaseTest.setUp Starting test case [testBug52811]
26-Oct-2021 10:21:24.122 INFO [main] org.apache.coyote.AbstractProtocol.init Initializing ProtocolHandler ["http-nio2-127.0.0.1-auto-13"]
26-Oct-2021 10:21:24.123 INFO [main] org.apache.catalina.core.StandardService.startInternal Starting service [Tomcat]
26-Oct-2021 10:21:24.123 INFO [main] org.apache.catalina.core.StandardEngine.startInternal Starting Servlet engine: [Apache Tomcat/8.5.72-dev]
26-Oct-2021 10:21:24.130 INFO [main] org.apache.coyote.AbstractProtocol.start Starting ProtocolHandler ["http-nio2-127.0.0.1-auto-13-34139"]
26-Oct-2021 10:21:24.146 INFO [main] org.apache.coyote.AbstractProtocol.pause Pausing ProtocolHandler ["http-nio2-127.0.0.1-auto-13-34139"]
26-Oct-2021 10:21:24.152 INFO [main] org.apache.catalina.core.StandardService.stopInternal Stopping service [Tomcat]
26-Oct-2021 10:21:24.155 INFO [main] org.apache.coyote.AbstractProtocol.stop Stopping ProtocolHandler ["http-nio2-127.0.0.1-auto-13-34139"]
26-Oct-2021 10:21:24.156 INFO [main] org.apache.coyote.AbstractProtocol.destroy Destroying ProtocolHandler ["http-nio2-127.0.0.1-auto-13-34139"]
26-Oct-2021 10:21:24.159 INFO [main] org.apache.catalina.startup.LoggingBaseTest.setUp Starting test case [testSetContentType01]
26-Oct-2021 10:21:24.160 INFO [main] org.apache.coyote.AbstractProtocol.destroy Destroying ProtocolHandler ["http-nio2-127.0.0.1-auto-14"]
26-Oct-2021 10:21:24.160 INFO [main] org.apache.catalina.startup.LoggingBaseTest.setUp Starting test case [testSetContentType02]
26-Oct-2021 10:21:24.161 INFO [main] org.apache.coyote.AbstractProtocol.destroy Destroying ProtocolHandler ["http-nio2-127.0.0.1-auto-15"]
26-Oct-2021 10:21:24.162 INFO [main] org.apache.catalina.startup.LoggingBaseTest.setUp Starting test case [testSetContentType03]
26-Oct-2021 10:21:24.164 INFO [main] org.apache.coyote.AbstractProtocol.destroy Destroying ProtocolHandler ["http-nio2-127.0.0.1-auto-16"]
26-Oct-2021 10:21:24.164 INFO [main] org.apache.catalina.startup.LoggingBaseTest.setUp Starting test case [testSetContentType04]
26-Oct-2021 10:21:24.165 INFO [main] org.apache.coyote.AbstractProtocol.destroy Destroying ProtocolHandler ["http-nio2-127.0.0.1-auto-17"]
26-Oct-2021 10:21:24.166 INFO [main] org.apache.catalina.startup.LoggingBaseTest.setUp Starting test case [testSetContentType05]
26-Oct-2021 10:21:24.167 WARNING [main] org.apache.catalina.connector.Response.setContentType The encoding [unknown] is not recognised by the JRE
	java.lang.IllegalArgumentException: java.io.UnsupportedEncodingException: The character encoding [unknown] is not supported
		at org.apache.coyote.Response.setCharacterEncoding(Response.java:485)
		at org.apache.catalina.connector.Response.setContentType(Response.java:786)
		at org.apache.catalina.connector.TestResponse.testSetContentType05(TestResponse.java:816)
		at java.base/jdk.internal.reflect.NativeMethodAccessorImpl.invoke0(Native Method)
		at java.base/jdk.internal.reflect.NativeMethodAccessorImpl.invoke(NativeMethodAccessorImpl.java:62)
		at java.base/jdk.internal.reflect.DelegatingMethodAccessorImpl.invoke(DelegatingMethodAccessorImpl.java:43)
		at java.base/java.lang.reflect.Method.invoke(Method.java:566)
		at org.junit.runners.model.FrameworkMethod$1.runReflectiveCall(FrameworkMethod.java:59)
		at org.junit.internal.runners.model.ReflectiveCallable.run(ReflectiveCallable.java:12)
		at org.junit.runners.model.FrameworkMethod.invokeExplosively(FrameworkMethod.java:61)
		at org.junit.internal.runners.statements.InvokeMethod.evaluate(InvokeMethod.java:17)
		at org.junit.internal.runners.statements.ExpectException.evaluate(ExpectException.java:19)
		at org.junit.internal.runners.statements.RunBefores.evaluate(RunBefores.java:26)
		at org.junit.internal.runners.statements.RunAfters.evaluate(RunAfters.java:27)
		at org.junit.rules.TestWatcher$1.evaluate(TestWatcher.java:61)
		at org.junit.runners.ParentRunner$3.evaluate(ParentRunner.java:306)
		at org.junit.runners.BlockJUnit4ClassRunner$1.evaluate(BlockJUnit4ClassRunner.java:100)
		at org.junit.runners.ParentRunner.runLeaf(ParentRunner.java:366)
		at org.junit.runners.BlockJUnit4ClassRunner.runChild(BlockJUnit4ClassRunner.java:103)
		at org.junit.runners.BlockJUnit4ClassRunner.runChild(BlockJUnit4ClassRunner.java:63)
		at org.junit.runners.ParentRunner$4.run(ParentRunner.java:331)
		at org.junit.runners.ParentRunner$1.schedule(ParentRunner.java:79)
		at org.junit.runners.ParentRunner.runChildren(ParentRunner.java:329)
		at org.junit.runners.ParentRunner.access$100(ParentRunner.java:66)
		at org.junit.runners.ParentRunner$2.evaluate(ParentRunner.java:293)
		at org.junit.internal.runners.statements.RunBefores.evaluate(RunBefores.java:26)
		at org.junit.internal.runners.statements.RunAfters.evaluate(RunAfters.java:27)
		at org.junit.runners.ParentRunner$3.evaluate(ParentRunner.java:306)
		at org.junit.runners.ParentRunner.run(ParentRunner.java:413)
		at junit.framework.JUnit4TestAdapter.run(JUnit4TestAdapter.java:50)
		at org.apache.tools.ant.taskdefs.optional.junit.JUnitTestRunner.run(JUnitTestRunner.java:535)
		at org.apache.tools.ant.taskdefs.optional.junit.JUnitTestRunner.launch(JUnitTestRunner.java:1197)
		at org.apache.tools.ant.taskdefs.optional.junit.JUnitTestRunner.main(JUnitTestRunner.java:1042)
	Caused by: java.io.UnsupportedEncodingException: The character encoding [unknown] is not supported
		at org.apache.tomcat.util.buf.B2CConverter.getCharsetLower(B2CConverter.java:87)
		at org.apache.tomcat.util.buf.B2CConverter.getCharset(B2CConverter.java:62)
		at org.apache.coyote.Response.setCharacterEncoding(Response.java:483)
		... 32 more
26-Oct-2021 10:21:24.168 WARNING [main] org.apache.catalina.connector.Response.setCharacterEncoding The encoding [unknown] is not recognised by the JRE

Continuation...

	java.lang.IllegalArgumentException: java.io.UnsupportedEncodingException: The character encoding [unknown] is not supported
		at org.apache.coyote.Response.setCharacterEncoding(Response.java:485)
		at org.apache.catalina.connector.Response.setCharacterEncoding(Response.java:823)
		at org.apache.catalina.connector.Response.getWriter(Response.java:603)
		at org.apache.catalina.connector.TestResponse.testSetContentType05(TestResponse.java:818)
		at java.base/jdk.internal.reflect.NativeMethodAccessorImpl.invoke0(Native Method)
		at java.base/jdk.internal.reflect.NativeMethodAccessorImpl.invoke(NativeMethodAccessorImpl.java:62)
		at java.base/jdk.internal.reflect.DelegatingMethodAccessorImpl.invoke(DelegatingMethodAccessorImpl.java:43)
		at java.base/java.lang.reflect.Method.invoke(Method.java:566)
		at org.junit.runners.model.FrameworkMethod$1.runReflectiveCall(FrameworkMethod.java:59)
		at org.junit.internal.runners.model.ReflectiveCallable.run(ReflectiveCallable.java:12)
		at org.junit.runners.model.FrameworkMethod.invokeExplosively(FrameworkMethod.java:61)
		at org.junit.internal.runners.statements.InvokeMethod.evaluate(InvokeMethod.java:17)
		at org.junit.internal.runners.statements.ExpectException.evaluate(ExpectException.java:19)
		at org.junit.internal.runners.statements.RunBefores.evaluate(RunBefores.java:26)
		at org.junit.internal.runners.statements.RunAfters.evaluate(RunAfters.java:27)
		at org.junit.rules.TestWatcher$1.evaluate(TestWatcher.java:61)
		at org.junit.runners.ParentRunner$3.evaluate(ParentRunner.java:306)
		at org.junit.runners.BlockJUnit4ClassRunner$1.evaluate(BlockJUnit4ClassRunner.java:100)
		at org.junit.runners.ParentRunner.runLeaf(ParentRunner.java:366)
		at org.junit.runners.BlockJUnit4ClassRunner.runChild(BlockJUnit4ClassRunner.java:103)
		at org.junit.runners.BlockJUnit4ClassRunner.runChild(BlockJUnit4ClassRunner.java:63)
		at org.junit.runners.ParentRunner$4.run(ParentRunner.java:331)
		at org.junit.runners.ParentRunner$1.schedule(ParentRunner.java:79)
		at org.junit.runners.ParentRunner.runChildren(ParentRunner.java:329)
		at org.junit.runners.ParentRunner.access$100(ParentRunner.java:66)
		at org.junit.runners.ParentRunner$2.evaluate(ParentRunner.java:293)
		at org.junit.internal.runners.statements.RunBefores.evaluate(RunBefores.java:26)
		at org.junit.internal.runners.statements.RunAfters.evaluate(RunAfters.java:27)
		at org.junit.runners.ParentRunner$3.evaluate(ParentRunner.java:306)
		at org.junit.runners.ParentRunner.run(ParentRunner.java:413)
		at junit.framework.JUnit4TestAdapter.run(JUnit4TestAdapter.java:50)
		at org.apache.tools.ant.taskdefs.optional.junit.JUnitTestRunner.run(JUnitTestRunner.java:535)
		at org.apache.tools.ant.taskdefs.optional.junit.JUnitTestRunner.launch(JUnitTestRunner.java:1197)
		at org.apache.tools.ant.taskdefs.optional.junit.JUnitTestRunner.main(JUnitTestRunner.java:1042)
	Caused by: java.io.UnsupportedEncodingException: The character encoding [unknown] is not supported
		at org.apache.tomcat.util.buf.B2CConverter.getCharsetLower(B2CConverter.java:87)
		at org.apache.tomcat.util.buf.B2CConverter.getCharset(B2CConverter.java:62)
		at org.apache.coyote.Response.setCharacterEncoding(Response.java:483)
		... 33 more
26-Oct-2021 10:21:24.168 INFO [main] org.apache.coyote.AbstractProtocol.destroy Destroying ProtocolHandler ["http-nio2-127.0.0.1-auto-18"]
26-Oct-2021 10:21:24.169 INFO [main] org.apache.catalina.startup.LoggingBaseTest.setUp Starting test case [testSetContentType06]
26-Oct-2021 10:21:24.170 WARNING [main] org.apache.catalina.connector.Response.setContentType The encoding [unknown] is not recognised by the JRE
	java.lang.IllegalArgumentException: java.io.UnsupportedEncodingException: The character encoding [unknown] is not supported
		at org.apache.coyote.Response.setCharacterEncoding(Response.java:485)
		at org.apache.catalina.connector.Response.setContentType(Response.java:786)
		at org.apache.catalina.connector.TestResponse.testSetContentType06(TestResponse.java:828)
		at java.base/jdk.internal.reflect.NativeMethodAccessorImpl.invoke0(Native Method)
		at java.base/jdk.internal.reflect.NativeMethodAccessorImpl.invoke(NativeMethodAccessorImpl.java:62)
		at java.base/jdk.internal.reflect.DelegatingMethodAccessorImpl.invoke(DelegatingMethodAccessorImpl.java:43)
		at java.base/java.lang.reflect.Method.invoke(Method.java:566)
		at org.junit.runners.model.FrameworkMethod$1.runReflectiveCall(FrameworkMethod.java:59)
		at org.junit.internal.runners.model.ReflectiveCallable.run(ReflectiveCallable.java:12)
		at org.junit.runners.model.FrameworkMethod.invokeExplosively(FrameworkMethod.java:61)
		at org.junit.internal.runners.statements.InvokeMethod.evaluate(InvokeMethod.java:17)
		at org.junit.internal.runners.statements.RunBefores.evaluate(RunBefores.java:26)
		at org.junit.internal.runners.statements.RunAfters.evaluate(RunAfters.java:27)
		at org.junit.rules.TestWatcher$1.evaluate(TestWatcher.java:61)
		at org.junit.runners.ParentRunner$3.evaluate(ParentRunner.java:306)
		at org.junit.runners.BlockJUnit4ClassRunner$1.evaluate(BlockJUnit4ClassRunner.java:100)
		at org.junit.runners.ParentRunner.runLeaf(ParentRunner.java:366)
		at org.junit.runners.BlockJUnit4ClassRunner.runChild(BlockJUnit4ClassRunner.java:103)
		at org.junit.runners.BlockJUnit4ClassRunner.runChild(BlockJUnit4ClassRunner.java:63)
		at org.junit.runners.ParentRunner$4.run(ParentRunner.java:331)
		at org.junit.runners.ParentRunner$1.schedule(ParentRunner.java:79)
		at org.junit.runners.ParentRunner.runChildren(ParentRunner.java:329)
		at org.junit.runners.ParentRunner.access$100(ParentRunner.java:66)
		at org.junit.runners.ParentRunner$2.evaluate(ParentRunner.java:293)
		at org.junit.internal.runners.statements.RunBefores.evaluate(RunBefores.java:26)
		at org.junit.internal.runners.statements.RunAfters.evaluate(RunAfters.java:27)
		at org.junit.runners.ParentRunner$3.evaluate(ParentRunner.java:306)
		at org.junit.runners.ParentRunner.run(ParentRunner.java:413)
		at junit.framework.JUnit4TestAdapter.run(JUnit4TestAdapter.java:50)
		at org.apache.tools.ant.taskdefs.optional.junit.JUnitTestRunner.run(JUnitTestRunner.java:535)
		at org.apache.tools.ant.taskdefs.optional.junit.JUnitTestRunner.launch(JUnitTestRunner.java:1197)
		at org.apache.tools.ant.taskdefs.optional.junit.JUnitTestRunner.main(JUnitTestRunner.java:1042)
	Caused by: java.io.UnsupportedEncodingException: The character encoding [unknown] is not supported
		at org.apache.tomcat.util.buf.B2CConverter.getCharsetLower(B2CConverter.java:87)
		at org.apache.tomcat.util.buf.B2CConverter.getCharset(B2CConverter.java:62)
		at org.apache.coyote.Response.setCharacterEncoding(Response.java:483)
		... 31 more
26-Oct-2021 10:21:24.170 INFO [main] org.apache.coyote.AbstractProtocol.destroy Destroying ProtocolHandler ["http-nio2-127.0.0.1-auto-19"]
26-Oct-2021 10:21:24.171 INFO [main] org.apache.catalina.startup.LoggingBaseTest.setUp Starting test case [testBug53062a]
26-Oct-2021 10:21:24.173 INFO [main] org.apache.coyote.AbstractProtocol.destroy Destroying ProtocolHandler ["http-nio2-127.0.0.1-auto-20"]
26-Oct-2021 10:21:24.174 INFO [main] org.apache.catalina.startup.LoggingBaseTest.setUp Starting test case [testBug53062b]
26-Oct-2021 10:21:24.174 INFO [main] org.apache.coyote.AbstractProtocol.destroy Destroying ProtocolHandler ["http-nio2-127.0.0.1-auto-21"]
26-Oct-2021 10:21:24.175 INFO [main] org.apache.catalina.startup.LoggingBaseTest.setUp Starting test case [testBug53062c]
26-Oct-2021 10:21:24.175 INFO [main] org.apache.coyote.AbstractProtocol.destroy Destroying ProtocolHandler ["http-nio2-127.0.0.1-auto-22"]
26-Oct-2021 10:21:24.176 INFO [main] org.apache.catalina.startup.LoggingBaseTest.setUp Starting test case [testBug53062d]
26-Oct-2021 10:21:24.176 INFO [main] org.apache.coyote.AbstractProtocol.destroy Destroying ProtocolHandler ["http-nio2-127.0.0.1-auto-23"]
26-Oct-2021 10:21:24.177 INFO [main] org.apache.catalina.startup.LoggingBaseTest.setUp Starting test case [testBug53062e]
26-Oct-2021 10:21:24.178 INFO [main] org.apache.coyote.AbstractProtocol.destroy Destroying ProtocolHandler ["http-nio2-127.0.0.1-auto-24"]
26-Oct-2021 10:21:24.178 INFO [main] org.apache.catalina.startup.LoggingBaseTest.setUp Starting test case [testBug53062f]
26-Oct-2021 10:21:24.179 INFO [main] org.apache.coyote.AbstractProtocol.destroy Destroying ProtocolHandler ["http-nio2-127.0.0.1-auto-25"]
26-Oct-2021 10:21:24.179 INFO [main] org.apache.catalina.startup.LoggingBaseTest.setUp Starting test case [testBug53062g]
26-Oct-2021 10:21:24.180 INFO [main] org.apache.coyote.AbstractProtocol.destroy Destroying ProtocolHandler ["http-nio2-127.0.0.1-auto-26"]
26-Oct-2021 10:21:24.180 INFO [main] org.apache.catalina.startup.LoggingBaseTest.setUp Starting test case [testBug53062h]
26-Oct-2021 10:21:24.181 INFO [main] org.apache.coyote.AbstractProtocol.destroy Destroying ProtocolHandler ["http-nio2-127.0.0.1-auto-27"]
26-Oct-2021 10:21:24.181 INFO [main] org.apache.catalina.startup.LoggingBaseTest.setUp Starting test case [testBug53062i]
26-Oct-2021 10:21:24.182 INFO [main] org.apache.coyote.AbstractProtocol.destroy Destroying ProtocolHandler ["http-nio2-127.0.0.1-auto-28"]
26-Oct-2021 10:21:24.182 INFO [main] org.apache.catalina.startup.LoggingBaseTest.setUp Starting test case [testBug53062j]
26-Oct-2021 10:21:24.183 INFO [main] org.apache.coyote.AbstractProtocol.destroy Destroying ProtocolHandler ["http-nio2-127.0.0.1-auto-29"]
26-Oct-2021 10:21:24.183 INFO [main] org.apache.catalina.startup.LoggingBaseTest.setUp Starting test case [testBug53062k]
26-Oct-2021 10:21:24.184 INFO [main] org.apache.coyote.AbstractProtocol.destroy Destroying ProtocolHandler ["http-nio2-127.0.0.1-auto-30"]
26-Oct-2021 10:21:24.184 INFO [main] org.apache.catalina.startup.LoggingBaseTest.setUp Starting test case [testBug53062l]
26-Oct-2021 10:21:24.185 INFO [main] org.apache.coyote.AbstractProtocol.destroy Destroying ProtocolHandler ["http-nio2-127.0.0.1-auto-31"]
26-Oct-2021 10:21:24.185 INFO [main] org.apache.catalina.startup.LoggingBaseTest.setUp Starting test case [testBug53062m]
26-Oct-2021 10:21:24.186 INFO [main] org.apache.coyote.AbstractProtocol.destroy Destroying ProtocolHandler ["http-nio2-127.0.0.1-auto-32"]
26-Oct-2021 10:21:24.186 INFO [main] org.apache.catalina.startup.LoggingBaseTest.setUp Starting test case [testBug53062n]
26-Oct-2021 10:21:24.187 INFO [main] org.apache.coyote.AbstractProtocol.destroy Destroying ProtocolHandler ["http-nio2-127.0.0.1-auto-33"]
26-Oct-2021 10:21:24.187 INFO [main] org.apache.catalina.startup.LoggingBaseTest.setUp Starting test case [testBug53062o]
26-Oct-2021 10:21:24.188 INFO [main] org.apache.coyote.AbstractProtocol.destroy Destroying ProtocolHandler ["http-nio2-127.0.0.1-auto-34"]
26-Oct-2021 10:21:24.188 INFO [main] org.apache.catalina.startup.LoggingBaseTest.setUp Starting test case [testBug53062p]
26-Oct-2021 10:21:24.189 INFO [main] org.apache.coyote.AbstractProtocol.destroy Destroying ProtocolHandler ["http-nio2-127.0.0.1-auto-35"]
26-Oct-2021 10:21:24.189 INFO [main] org.apache.catalina.startup.LoggingBaseTest.setUp Starting test case [testBug53469a]
26-Oct-2021 10:21:24.190 INFO [main] org.apache.coyote.AbstractProtocol.destroy Destroying ProtocolHandler ["http-nio2-127.0.0.1-auto-36"]
26-Oct-2021 10:21:24.191 INFO [main] org.apache.catalina.startup.LoggingBaseTest.setUp Starting test case [testBug53469b]
26-Oct-2021 10:21:24.191 INFO [main] org.apache.coyote.AbstractProtocol.destroy Destroying ProtocolHandler ["http-nio2-127.0.0.1-auto-37"]
26-Oct-2021 10:21:24.192 INFO [main] org.apache.catalina.startup.LoggingBaseTest.setUp Starting test case [testCharset]
26-Oct-2021 10:21:24.193 INFO [main] org.apache.coyote.AbstractProtocol.init Initializing ProtocolHandler ["http-nio2-127.0.0.1-auto-38"]
26-Oct-2021 10:21:24.194 INFO [main] org.apache.catalina.core.StandardService.startInternal Starting service [Tomcat]
26-Oct-2021 10:21:24.194 INFO [main] org.apache.catalina.core.StandardEngine.startInternal Starting Servlet engine: [Apache Tomcat/8.5.72-dev]
26-Oct-2021 10:21:24.203 INFO [main] org.apache.coyote.AbstractProtocol.start Starting ProtocolHandler ["http-nio2-127.0.0.1-auto-38-45767"]
26-Oct-2021 10:21:24.207 INFO [main] org.apache.coyote.AbstractProtocol.pause Pausing ProtocolHandler ["http-nio2-127.0.0.1-auto-38-45767"]
26-Oct-2021 10:21:24.213 INFO [main] org.apache.catalina.core.StandardService.stopInternal Stopping service [Tomcat]
26-Oct-2021 10:21:24.218 INFO [main] org.apache.coyote.AbstractProtocol.stop Stopping ProtocolHandler ["http-nio2-127.0.0.1-auto-38-45767"]
26-Oct-2021 10:21:24.219 INFO [main] org.apache.coyote.AbstractProtocol.destroy Destroying ProtocolHandler ["http-nio2-127.0.0.1-auto-38-45767"]
26-Oct-2021 10:21:24.230 INFO [main] org.apache.catalina.startup.LoggingBaseTest.setUp Starting test case [testSetCharacterEncoding01]
26-Oct-2021 10:21:24.231 INFO [main] org.apache.coyote.AbstractProtocol.destroy Destroying ProtocolHandler ["http-nio2-127.0.0.1-auto-39"]
26-Oct-2021 10:21:24.232 INFO [main] org.apache.catalina.startup.LoggingBaseTest.setUp Starting test case [testSetCharacterEncoding02]
26-Oct-2021 10:21:24.233 INFO [main] org.apache.coyote.AbstractProtocol.destroy Destroying ProtocolHandler ["http-nio2-127.0.0.1-auto-40"]
26-Oct-2021 10:21:24.234 INFO [main] org.apache.catalina.startup.LoggingBaseTest.setUp Starting test case [testSetCharacterEncoding03]
26-Oct-2021 10:21:24.234 INFO [main] org.apache.coyote.AbstractProtocol.destroy Destroying ProtocolHandler ["http-nio2-127.0.0.1-auto-41"]
26-Oct-2021 10:21:24.235 INFO [main] org.apache.catalina.startup.LoggingBaseTest.setUp Starting test case [testSetCharacterEncoding04]
26-Oct-2021 10:21:24.236 INFO [main] org.apache.coyote.AbstractProtocol.destroy Destroying ProtocolHandler ["http-nio2-127.0.0.1-auto-42"]
26-Oct-2021 10:21:24.237 INFO [main] org.apache.catalina.startup.LoggingBaseTest.setUp Starting test case [testSetCharacterEncoding05]
26-Oct-2021 10:21:24.237 INFO [main] org.apache.coyote.AbstractProtocol.destroy Destroying ProtocolHandler ["http-nio2-127.0.0.1-auto-43"]
26-Oct-2021 10:21:24.238 INFO [main] org.apache.catalina.startup.LoggingBaseTest.setUp Starting test case [testSetCharacterEncoding06]
26-Oct-2021 10:21:24.238 WARNING [main] org.apache.catalina.connector.Response.setCharacterEncoding The encoding [unknown] is not recognised by the JRE
	java.lang.IllegalArgumentException: java.io.UnsupportedEncodingException: The character encoding [unknown] is not supported
		at org.apache.coyote.Response.setCharacterEncoding(Response.java:485)
		at org.apache.catalina.connector.Response.setCharacterEncoding(Response.java:823)
		at org.apache.catalina.connector.TestResponse.testSetCharacterEncoding06(TestResponse.java:720)
		at java.base/jdk.internal.reflect.NativeMethodAccessorImpl.invoke0(Native Method)
		at java.base/jdk.internal.reflect.NativeMethodAccessorImpl.invoke(NativeMethodAccessorImpl.java:62)
		at java.base/jdk.internal.reflect.DelegatingMethodAccessorImpl.invoke(DelegatingMethodAccessorImpl.java:43)
		at java.base/java.lang.reflect.Method.invoke(Method.java:566)
		at org.junit.runners.model.FrameworkMethod$1.runReflectiveCall(FrameworkMethod.java:59)
		at org.junit.internal.runners.model.ReflectiveCallable.run(ReflectiveCallable.java:12)
		at org.junit.runners.model.FrameworkMethod.invokeExplosively(FrameworkMethod.java:61)
		at org.junit.internal.runners.statements.InvokeMethod.evaluate(InvokeMethod.java:17)
		at org.junit.internal.runners.statements.ExpectException.evaluate(ExpectException.java:19)
		at org.junit.internal.runners.statements.RunBefores.evaluate(RunBefores.java:26)
		at org.junit.internal.runners.statements.RunAfters.evaluate(RunAfters.java:27)
		at org.junit.rules.TestWatcher$1.evaluate(TestWatcher.java:61)
		at org.junit.runners.ParentRunner$3.evaluate(ParentRunner.java:306)
		at org.junit.runners.BlockJUnit4ClassRunner$1.evaluate(BlockJUnit4ClassRunner.java:100)
		at org.junit.runners.ParentRunner.runLeaf(ParentRunner.java:366)
		at org.junit.runners.BlockJUnit4ClassRunner.runChild(BlockJUnit4ClassRunner.java:103)
		at org.junit.runners.BlockJUnit4ClassRunner.runChild(BlockJUnit4ClassRunner.java:63)
		at org.junit.runners.ParentRunner$4.run(ParentRunner.java:331)
		at org.junit.runners.ParentRunner$1.schedule(ParentRunner.java:79)
		at org.junit.runners.ParentRunner.runChildren(ParentRunner.java:329)
		at org.junit.runners.ParentRunner.access$100(ParentRunner.java:66)
		at org.junit.runners.ParentRunner$2.evaluate(ParentRunner.java:293)
		at org.junit.internal.runners.statements.RunBefores.evaluate(RunBefores.java:26)
		at org.junit.internal.runners.statements.RunAfters.evaluate(RunAfters.java:27)
		at org.junit.runners.ParentRunner$3.evaluate(ParentRunner.java:306)
		at org.junit.runners.ParentRunner.run(ParentRunner.java:413)
		at junit.framework.JUnit4TestAdapter.run(JUnit4TestAdapter.java:50)
		at org.apache.tools.ant.taskdefs.optional.junit.JUnitTestRunner.run(JUnitTestRunner.java:535)
		at org.apache.tools.ant.taskdefs.optional.junit.JUnitTestRunner.launch(JUnitTestRunner.java:1197)
		at org.apache.tools.ant.taskdefs.optional.junit.JUnitTestRunner.main(JUnitTestRunner.java:1042)
	Caused by: java.io.UnsupportedEncodingException: The character encoding [unknown] is not supported
		at org.apache.tomcat.util.buf.B2CConverter.getCharsetLower(B2CConverter.java:87)
		at org.apache.tomcat.util.buf.B2CConverter.getCharset(B2CConverter.java:62)
		at org.apache.coyote.Response.setCharacterEncoding(Response.java:483)
		... 32 more
26-Oct-2021 10:21:24.239 WARNING [main] org.apache.catalina.connector.Response.setCharacterEncoding The encoding [unknown] is not recognised by the JRE
	java.lang.IllegalArgumentException: java.io.UnsupportedEncodingException: The character encoding [unknown] is not supported
		at org.apache.coyote.Response.setCharacterEncoding(Response.java:485)
		at org.apache.catalina.connector.Response.setCharacterEncoding(Response.java:823)
		at org.apache.catalina.connector.Response.getWriter(Response.java:603)
		at org.apache.catalina.connector.TestResponse.testSetCharacterEncoding06(TestResponse.java:722)
		at java.base/jdk.internal.reflect.NativeMethodAccessorImpl.invoke0(Native Method)
		at java.base/jdk.internal.reflect.NativeMethodAccessorImpl.invoke(NativeMethodAccessorImpl.java:62)
		at java.base/jdk.internal.reflect.DelegatingMethodAccessorImpl.invoke(DelegatingMethodAccessorImpl.java:43)
		at java.base/java.lang.reflect.Method.invoke(Method.java:566)
		at org.junit.runners.model.FrameworkMethod$1.runReflectiveCall(FrameworkMethod.java:59)
		at org.junit.internal.runners.model.ReflectiveCallable.run(ReflectiveCallable.java:12)
		at org.junit.runners.model.FrameworkMethod.invokeExplosively(FrameworkMethod.java:61)
		at org.junit.internal.runners.statements.InvokeMethod.evaluate(InvokeMethod.java:17)
		at org.junit.internal.runners.statements.ExpectException.evaluate(ExpectException.java:19)
		at org.junit.internal.runners.statements.RunBefores.evaluate(RunBefores.java:26)
		at org.junit.internal.runners.statements.RunAfters.evaluate(RunAfters.java:27)
		at org.junit.rules.TestWatcher$1.evaluate(TestWatcher.java:61)
		at org.junit.runners.ParentRunner$3.evaluate(ParentRunner.java:306)
		at org.junit.runners.BlockJUnit4ClassRunner$1.evaluate(BlockJUnit4ClassRunner.java:100)
		at org.junit.runners.ParentRunner.runLeaf(ParentRunner.java:366)
		at org.junit.runners.BlockJUnit4ClassRunner.runChild(BlockJUnit4ClassRunner.java:103)
		at org.junit.runners.BlockJUnit4ClassRunner.runChild(BlockJUnit4ClassRunner.java:63)
		at org.junit.runners.ParentRunner$4.run(ParentRunner.java:331)
		at org.junit.runners.ParentRunner$1.schedule(ParentRunner.java:79)
		at org.junit.runners.ParentRunner.runChildren(ParentRunner.java:329)
		at org.junit.runners.ParentRunner.access$100(ParentRunner.java:66)
		at org.junit.runners.ParentRunner$2.evaluate(ParentRunner.java:293)

Continuation...

		at org.junit.internal.runners.statements.RunBefores.evaluate(RunBefores.java:26)
		at org.junit.internal.runners.statements.RunAfters.evaluate(RunAfters.java:27)
		at org.junit.runners.ParentRunner$3.evaluate(ParentRunner.java:306)
		at org.junit.runners.ParentRunner.run(ParentRunner.java:413)
		at junit.framework.JUnit4TestAdapter.run(JUnit4TestAdapter.java:50)
		at org.apache.tools.ant.taskdefs.optional.junit.JUnitTestRunner.run(JUnitTestRunner.java:535)
		at org.apache.tools.ant.taskdefs.optional.junit.JUnitTestRunner.launch(JUnitTestRunner.java:1197)
		at org.apache.tools.ant.taskdefs.optional.junit.JUnitTestRunner.main(JUnitTestRunner.java:1042)
	Caused by: java.io.UnsupportedEncodingException: The character encoding [unknown] is not supported
		at org.apache.tomcat.util.buf.B2CConverter.getCharsetLower(B2CConverter.java:87)
		at org.apache.tomcat.util.buf.B2CConverter.getCharset(B2CConverter.java:62)
		at org.apache.coyote.Response.setCharacterEncoding(Response.java:483)
		... 33 more
26-Oct-2021 10:21:24.240 INFO [main] org.apache.coyote.AbstractProtocol.destroy Destroying ProtocolHandler ["http-nio2-127.0.0.1-auto-44"]
26-Oct-2021 10:21:24.240 INFO [main] org.apache.catalina.startup.LoggingBaseTest.setUp Starting test case [testSetCharacterEncoding07]
26-Oct-2021 10:21:24.241 WARNING [main] org.apache.catalina.connector.Response.setCharacterEncoding The encoding [unknown] is not recognised by the JRE
	java.lang.IllegalArgumentException: java.io.UnsupportedEncodingException: The character encoding [unknown] is not supported
		at org.apache.coyote.Response.setCharacterEncoding(Response.java:485)
		at org.apache.catalina.connector.Response.setCharacterEncoding(Response.java:823)
		at org.apache.catalina.connector.TestResponse.testSetCharacterEncoding07(TestResponse.java:732)
		at java.base/jdk.internal.reflect.NativeMethodAccessorImpl.invoke0(Native Method)
		at java.base/jdk.internal.reflect.NativeMethodAccessorImpl.invoke(NativeMethodAccessorImpl.java:62)
		at java.base/jdk.internal.reflect.DelegatingMethodAccessorImpl.invoke(DelegatingMethodAccessorImpl.java:43)
		at java.base/java.lang.reflect.Method.invoke(Method.java:566)
		at org.junit.runners.model.FrameworkMethod$1.runReflectiveCall(FrameworkMethod.java:59)
		at org.junit.internal.runners.model.ReflectiveCallable.run(ReflectiveCallable.java:12)
		at org.junit.runners.model.FrameworkMethod.invokeExplosively(FrameworkMethod.java:61)
		at org.junit.internal.runners.statements.InvokeMethod.evaluate(InvokeMethod.java:17)
		at org.junit.internal.runners.statements.RunBefores.evaluate(RunBefores.java:26)
		at org.junit.internal.runners.statements.RunAfters.evaluate(RunAfters.java:27)
		at org.junit.rules.TestWatcher$1.evaluate(TestWatcher.java:61)
		at org.junit.runners.ParentRunner$3.evaluate(ParentRunner.java:306)
		at org.junit.runners.BlockJUnit4ClassRunner$1.evaluate(BlockJUnit4ClassRunner.java:100)
		at org.junit.runners.ParentRunner.runLeaf(ParentRunner.java:366)
		at org.junit.runners.BlockJUnit4ClassRunner.runChild(BlockJUnit4ClassRunner.java:103)
		at org.junit.runners.BlockJUnit4ClassRunner.runChild(BlockJUnit4ClassRunner.java:63)
		at org.junit.runners.ParentRunner$4.run(ParentRunner.java:331)
		at org.junit.runners.ParentRunner$1.schedule(ParentRunner.java:79)
		at org.junit.runners.ParentRunner.runChildren(ParentRunner.java:329)
		at org.junit.runners.ParentRunner.access$100(ParentRunner.java:66)
		at org.junit.runners.ParentRunner$2.evaluate(ParentRunner.java:293)
		at org.junit.internal.runners.statements.RunBefores.evaluate(RunBefores.java:26)
		at org.junit.internal.runners.statements.RunAfters.evaluate(RunAfters.java:27)
		at org.junit.runners.ParentRunner$3.evaluate(ParentRunner.java:306)
		at org.junit.runners.ParentRunner.run(ParentRunner.java:413)
		at junit.framework.JUnit4TestAdapter.run(JUnit4TestAdapter.java:50)
		at org.apache.tools.ant.taskdefs.optional.junit.JUnitTestRunner.run(JUnitTestRunner.java:535)
		at org.apache.tools.ant.taskdefs.optional.junit.JUnitTestRunner.launch(JUnitTestRunner.java:1197)
		at org.apache.tools.ant.taskdefs.optional.junit.JUnitTestRunner.main(JUnitTestRunner.java:1042)
	Caused by: java.io.UnsupportedEncodingException: The character encoding [unknown] is not supported
		at org.apache.tomcat.util.buf.B2CConverter.getCharsetLower(B2CConverter.java:87)
		at org.apache.tomcat.util.buf.B2CConverter.getCharset(B2CConverter.java:62)
		at org.apache.coyote.Response.setCharacterEncoding(Response.java:483)
		... 31 more
26-Oct-2021 10:21:24.241 INFO [main] org.apache.coyote.AbstractProtocol.destroy Destroying ProtocolHandler ["http-nio2-127.0.0.1-auto-45"]
26-Oct-2021 10:21:24.242 INFO [main] org.apache.catalina.startup.LoggingBaseTest.setUp Starting test case [testSetCharacterEncoding08]
26-Oct-2021 10:21:24.242 INFO [main] org.apache.coyote.AbstractProtocol.destroy Destroying ProtocolHandler ["http-nio2-127.0.0.1-auto-46"]
26-Oct-2021 10:21:24.243 INFO [main] org.apache.catalina.startup.LoggingBaseTest.setUp Starting test case [testEncodeURL01]
26-Oct-2021 10:21:24.243 INFO [main] org.apache.coyote.AbstractProtocol.destroy Destroying ProtocolHandler ["http-nio2-127.0.0.1-auto-47"]
26-Oct-2021 10:21:24.244 INFO [main] org.apache.catalina.startup.LoggingBaseTest.setUp Starting test case [testEncodeURL02]
26-Oct-2021 10:21:24.244 INFO [main] org.apache.coyote.AbstractProtocol.destroy Destroying ProtocolHandler ["http-nio2-127.0.0.1-auto-48"]
26-Oct-2021 10:21:24.245 INFO [main] org.apache.catalina.startup.LoggingBaseTest.setUp Starting test case [testEncodeURL03]
26-Oct-2021 10:21:24.245 INFO [main] org.apache.coyote.AbstractProtocol.destroy Destroying ProtocolHandler ["http-nio2-127.0.0.1-auto-49"]
26-Oct-2021 10:21:24.246 INFO [main] org.apache.catalina.startup.LoggingBaseTest.setUp Starting test case [testEncodeURL04]
26-Oct-2021 10:21:24.246 INFO [main] org.apache.coyote.AbstractProtocol.destroy Destroying ProtocolHandler ["http-nio2-127.0.0.1-auto-50"]
26-Oct-2021 10:21:24.247 INFO [main] org.apache.catalina.startup.LoggingBaseTest.setUp Starting test case [testEncodeURL06]
26-Oct-2021 10:21:24.247 INFO [main] org.apache.coyote.AbstractProtocol.destroy Destroying ProtocolHandler ["http-nio2-127.0.0.1-auto-51"]
26-Oct-2021 10:21:24.248 INFO [main] org.apache.catalina.startup.LoggingBaseTest.setUp Starting test case [testEncodeURL07]
26-Oct-2021 10:21:24.248 INFO [main] org.apache.coyote.AbstractProtocol.destroy Destroying ProtocolHandler ["http-nio2-127.0.0.1-auto-52"]
26-Oct-2021 10:21:24.249 INFO [main] org.apache.catalina.startup.LoggingBaseTest.setUp Starting test case [testEncodeURL08]
26-Oct-2021 10:21:24.249 INFO [main] org.apache.coyote.AbstractProtocol.destroy Destroying ProtocolHandler ["http-nio2-127.0.0.1-auto-53"]
26-Oct-2021 10:21:24.250 INFO [main] org.apache.catalina.startup.LoggingBaseTest.setUp Starting test case [testEncodeURL09]
26-Oct-2021 10:21:24.250 INFO [main] org.apache.coyote.AbstractProtocol.destroy Destroying ProtocolHandler ["http-nio2-127.0.0.1-auto-54"]
26-Oct-2021 10:21:24.251 INFO [main] org.apache.catalina.startup.LoggingBaseTest.setUp Starting test case [testEncodeURL10]
26-Oct-2021 10:21:24.251 INFO [main] org.apache.coyote.AbstractProtocol.destroy Destroying ProtocolHandler ["http-nio2-127.0.0.1-auto-55"]
26-Oct-2021 10:21:24.252 INFO [main] org.apache.catalina.startup.LoggingBaseTest.setUp Starting test case [testEncodeURL11]
26-Oct-2021 10:21:24.252 INFO [main] org.apache.coyote.AbstractProtocol.destroy Destroying ProtocolHandler ["http-nio2-127.0.0.1-auto-56"]
26-Oct-2021 10:21:24.253 INFO [main] org.apache.catalina.startup.LoggingBaseTest.setUp Starting test case [testEncodeURL12]
26-Oct-2021 10:21:24.253 INFO [main] org.apache.coyote.AbstractProtocol.destroy Destroying ProtocolHandler ["http-nio2-127.0.0.1-auto-57"]
26-Oct-2021 10:21:24.254 INFO [main] org.apache.catalina.startup.LoggingBaseTest.setUp Starting test case [testEncodeURL13]
26-Oct-2021 10:21:24.254 INFO [main] org.apache.coyote.AbstractProtocol.destroy Destroying ProtocolHandler ["http-nio2-127.0.0.1-auto-58"]
26-Oct-2021 10:21:24.255 INFO [main] org.apache.catalina.startup.LoggingBaseTest.setUp Starting test case [testEncodeURL14]
26-Oct-2021 10:21:24.255 INFO [main] org.apache.coyote.AbstractProtocol.destroy Destroying ProtocolHandler ["http-nio2-127.0.0.1-auto-59"]
26-Oct-2021 10:21:24.256 INFO [main] org.apache.catalina.startup.LoggingBaseTest.setUp Starting test case [testEncodeURL15]
26-Oct-2021 10:21:24.256 INFO [main] org.apache.coyote.AbstractProtocol.destroy Destroying ProtocolHandler ["http-nio2-127.0.0.1-auto-60"]
26-Oct-2021 10:21:24.257 INFO [main] org.apache.catalina.startup.LoggingBaseTest.setUp Starting test case [testEncodeURL16]
26-Oct-2021 10:21:24.257 INFO [main] org.apache.coyote.AbstractProtocol.destroy Destroying ProtocolHandler ["http-nio2-127.0.0.1-auto-61"]
26-Oct-2021 10:21:24.258 INFO [main] org.apache.catalina.startup.LoggingBaseTest.setUp Starting test case [testEncodeRedirectURL01]
26-Oct-2021 10:21:24.258 INFO [main] org.apache.coyote.AbstractProtocol.destroy Destroying ProtocolHandler ["http-nio2-127.0.0.1-auto-62"]
26-Oct-2021 10:21:24.259 INFO [main] org.apache.catalina.startup.LoggingBaseTest.setUp Starting test case [testEncodeRedirectURL02]
26-Oct-2021 10:21:24.259 INFO [main] org.apache.coyote.AbstractProtocol.destroy Destroying ProtocolHandler ["http-nio2-127.0.0.1-auto-63"]
26-Oct-2021 10:21:24.260 INFO [main] org.apache.catalina.startup.LoggingBaseTest.setUp Starting test case [testEncodeRedirectURL03]
26-Oct-2021 10:21:24.260 INFO [main] org.apache.coyote.AbstractProtocol.destroy Destroying ProtocolHandler ["http-nio2-127.0.0.1-auto-64"]
26-Oct-2021 10:21:24.261 INFO [main] org.apache.catalina.startup.LoggingBaseTest.setUp Starting test case [testEncodeRedirectURL04]
26-Oct-2021 10:21:24.261 INFO [main] org.apache.coyote.AbstractProtocol.destroy Destroying ProtocolHandler ["http-nio2-127.0.0.1-auto-65"]
26-Oct-2021 10:21:24.262 INFO [main] org.apache.catalina.startup.LoggingBaseTest.setUp Starting test case [testEncodeRedirectURL05]
26-Oct-2021 10:21:24.262 INFO [main] org.apache.coyote.AbstractProtocol.destroy Destroying ProtocolHandler ["http-nio2-127.0.0.1-auto-66"]
26-Oct-2021 10:21:24.263 INFO [main] org.apache.catalina.startup.LoggingBaseTest.setUp Starting test case [testEncodeRedirectURL06]
26-Oct-2021 10:21:24.263 INFO [main] org.apache.coyote.AbstractProtocol.destroy Destroying ProtocolHandler ["http-nio2-127.0.0.1-auto-67"]
26-Oct-2021 10:21:24.264 INFO [main] org.apache.catalina.startup.LoggingBaseTest.setUp Starting test case [testEncodeRedirectURL07]
26-Oct-2021 10:21:24.264 INFO [main] org.apache.coyote.AbstractProtocol.destroy Destroying ProtocolHandler ["http-nio2-127.0.0.1-auto-68"]
26-Oct-2021 10:21:24.265 INFO [main] org.apache.catalina.startup.LoggingBaseTest.setUp Starting test case [testEncodeRedirectURL08]
26-Oct-2021 10:21:24.265 INFO [main] org.apache.coyote.AbstractProtocol.destroy Destroying ProtocolHandler ["http-nio2-127.0.0.1-auto-69"]
26-Oct-2021 10:21:24.266 INFO [main] org.apache.catalina.startup.LoggingBaseTest.setUp Starting test case [testEncodeRedirectURL09]
26-Oct-2021 10:21:24.266 INFO [main] org.apache.coyote.AbstractProtocol.destroy Destroying ProtocolHandler ["http-nio2-127.0.0.1-auto-70"]
26-Oct-2021 10:21:24.267 INFO [main] org.apache.catalina.startup.LoggingBaseTest.setUp Starting test case [testEncodeRedirectURL10]
26-Oct-2021 10:21:24.267 INFO [main] org.apache.coyote.AbstractProtocol.destroy Destroying ProtocolHandler ["http-nio2-127.0.0.1-auto-71"]
26-Oct-2021 10:21:24.268 INFO [main] org.apache.catalina.startup.LoggingBaseTest.setUp Starting test case [testEncodeRedirectURL11]
26-Oct-2021 10:21:24.269 INFO [main] org.apache.coyote.AbstractProtocol.destroy Destroying ProtocolHandler ["http-nio2-127.0.0.1-auto-72"]
26-Oct-2021 10:21:24.269 INFO [main] org.apache.catalina.startup.LoggingBaseTest.setUp Starting test case [testEncodeRedirectURL12]
26-Oct-2021 10:21:24.269 INFO [main] org.apache.coyote.AbstractProtocol.destroy Destroying ProtocolHandler ["http-nio2-127.0.0.1-auto-73"]
26-Oct-2021 10:21:24.270 INFO [main] org.apache.catalina.startup.LoggingBaseTest.setUp Starting test case [testEncodeRedirectURL13]
26-Oct-2021 10:21:24.270 INFO [main] org.apache.coyote.AbstractProtocol.destroy Destroying ProtocolHandler ["http-nio2-127.0.0.1-auto-74"]
26-Oct-2021 10:21:24.271 INFO [main] org.apache.catalina.startup.LoggingBaseTest.setUp Starting test case [testEncodeRedirectURL14]
26-Oct-2021 10:21:24.271 INFO [main] org.apache.coyote.AbstractProtocol.destroy Destroying ProtocolHandler ["http-nio2-127.0.0.1-auto-75"]
26-Oct-2021 10:21:24.272 INFO [main] org.apache.catalina.startup.LoggingBaseTest.setUp Starting test case [testEncodeRedirectURL15]
26-Oct-2021 10:21:24.272 INFO [main] org.apache.coyote.AbstractProtocol.destroy Destroying ProtocolHandler ["http-nio2-127.0.0.1-auto-76"]
26-Oct-2021 10:21:24.273 INFO [main] org.apache.catalina.startup.LoggingBaseTest.setUp Starting test case [testEncodeRedirectURL16]
26-Oct-2021 10:21:24.273 INFO [main] org.apache.coyote.AbstractProtocol.destroy Destroying ProtocolHandler ["http-nio2-127.0.0.1-auto-77"]
------------- ---------------- ---------------

Testcase: testSendRedirect01 took 0.249 sec
Testcase: testSendRedirect02 took 0.002 sec
Testcase: testSendRedirect03 took 0.002 sec
Testcase: testSetLocale01 took 0.005 sec
Testcase: testSetLocale02 took 0.002 sec
Testcase: testSetLocale03 took 0.002 sec
Testcase: testSetLocale04 took 0.001 sec
Testcase: testSetLocale05 took 0.008 sec
Testcase: testSetLocale06 took 0.003 sec
Testcase: testSetLocale07 took 0.001 sec
Testcase: testSetLocale08 took 0.005 sec
Testcase: testBug49598 took 0.474 sec
Testcase: testBug52811 took 0.04 sec
Testcase: testSetContentType01 took 0.002 sec
Testcase: testSetContentType02 took 0.001 sec
Testcase: testSetContentType03 took 0.003 sec
Testcase: testSetContentType04 took 0.001 sec
Testcase: testSetContentType05 took 0.004 sec
Testcase: testSetContentType06 took 0.001 sec
Testcase: testBug53062a took 0.002 sec
Testcase: testBug53062b took 0.001 sec
Testcase: testBug53062c took 0.001 sec
Testcase: testBug53062d took 0.001 sec
Testcase: testBug53062e took 0.001 sec
Testcase: testBug53062f took 0.001 sec
Testcase: testBug53062g took 0.001 sec
Testcase: testBug53062h took 0.001 sec
Testcase: testBug53062i took 0.001 sec
Testcase: testBug53062j took 0.001 sec
Testcase: testBug53062k took 0.001 sec
Testcase: testBug53062l took 0.001 sec
Testcase: testBug53062m took 0.001 sec
Testcase: testBug53062n took 0.001 sec
Testcase: testBug53062o took 0.001 sec
Testcase: testBug53062p took 0.001 sec
Testcase: testBug53469a took 0.001 sec
Testcase: testBug53469b took 0.001 sec
Testcase: testCharset took 0.032 sec
Testcase: testSetCharacterEncoding01 took 0.009 sec
Testcase: testSetCharacterEncoding02 took 0.001 sec
Testcase: testSetCharacterEncoding03 took 0.001 sec
Testcase: testSetCharacterEncoding04 took 0.001 sec
Testcase: testSetCharacterEncoding05 took 0.001 sec
Testcase: testSetCharacterEncoding06 took 0.002 sec
Testcase: testSetCharacterEncoding07 took 0.001 sec
Testcase: testSetCharacterEncoding08 took 0 sec
Testcase: testEncodeURL01 took 0.001 sec
Testcase: testEncodeURL02 took 0.001 sec
Testcase: testEncodeURL03 took 0.001 sec
Testcase: testEncodeURL04 took 0.001 sec
Testcase: testEncodeURL06 took 0.001 sec
Testcase: testEncodeURL07 took 0.001 sec
Testcase: testEncodeURL08 took 0.001 sec
Testcase: testEncodeURL09 took 0.001 sec
Testcase: testEncodeURL10 took 0.001 sec
Testcase: testEncodeURL11 took 0.001 sec
Testcase: testEncodeURL12 took 0.001 sec
Testcase: testEncodeURL13 took 0.001 sec
Testcase: testEncodeURL14 took 0 sec
Testcase: testEncodeURL15 took 0 sec
Testcase: testEncodeURL16 took 0 sec
Testcase: testEncodeRedirectURL01 took 0 sec
Testcase: testEncodeRedirectURL02 took 0 sec
Testcase: testEncodeRedirectURL03 took 0 sec
Testcase: testEncodeRedirectURL04 took 0 sec
Testcase: testEncodeRedirectURL05 took 0 sec
Testcase: testEncodeRedirectURL06 took 0 sec
Testcase: testEncodeRedirectURL07 took 0 sec
Testcase: testEncodeRedirectURL08 took 0 sec
Testcase: testEncodeRedirectURL09 took 0.001 sec
Testcase: testEncodeRedirectURL10 took 0.001 sec
Testcase: testEncodeRedirectURL11 took 0.001 sec
Testcase: testEncodeRedirectURL12 took 0.001 sec
Testcase: testEncodeRedirectURL13 took 0.001 sec
Testcase: testEncodeRedirectURL14 took 0 sec
Testcase: testEncodeRedirectURL15 took 0 sec
Testcase: testEncodeRedirectURL16 took 0 sec

Apache Gump, Gump, Apache, the Apache feather logo, and the Apache Gump project logos are trademarks of The Apache Software Foundation.

Last Updated: Tue, 26 Oct 2021 06:00:05 ().Python Logo