Run| Workspace| Log| Issues| Fixes| Pre-reqs| Stats| XRef| Maven Repository Proxy Log Gump Logo

Details

File Contents

Testsuite: org.apache.catalina.connector.TestResponse
Tests run: 77, Failures: 0, Errors: 0, Skipped: 0, Time elapsed: 0.816 sec
------------- Standard Error -----------------
07-Dec-2022 08:22:46.295 INFO [main] org.apache.catalina.startup.LoggingBaseTest.setUp Starting test case [testSendRedirect01]
07-Dec-2022 08:22:46.402 INFO [main] org.apache.coyote.AbstractProtocol.destroy Destroying ProtocolHandler ["http-nio-127.0.0.1-auto-1"]
07-Dec-2022 08:22:46.407 INFO [main] org.apache.catalina.startup.LoggingBaseTest.setUp Starting test case [testSendRedirect02]
07-Dec-2022 08:22:46.408 INFO [main] org.apache.coyote.AbstractProtocol.destroy Destroying ProtocolHandler ["http-nio-127.0.0.1-auto-2"]
07-Dec-2022 08:22:46.409 INFO [main] org.apache.catalina.startup.LoggingBaseTest.setUp Starting test case [testSendRedirect03]
07-Dec-2022 08:22:46.410 INFO [main] org.apache.coyote.AbstractProtocol.destroy Destroying ProtocolHandler ["http-nio-127.0.0.1-auto-3"]
07-Dec-2022 08:22:46.410 INFO [main] org.apache.catalina.startup.LoggingBaseTest.setUp Starting test case [testSetLocale01]
07-Dec-2022 08:22:46.414 INFO [main] org.apache.coyote.AbstractProtocol.destroy Destroying ProtocolHandler ["http-nio-127.0.0.1-auto-4"]
07-Dec-2022 08:22:46.414 INFO [main] org.apache.catalina.startup.LoggingBaseTest.setUp Starting test case [testSetLocale02]
07-Dec-2022 08:22:46.415 INFO [main] org.apache.coyote.AbstractProtocol.destroy Destroying ProtocolHandler ["http-nio-127.0.0.1-auto-5"]
07-Dec-2022 08:22:46.416 INFO [main] org.apache.catalina.startup.LoggingBaseTest.setUp Starting test case [testSetLocale03]
07-Dec-2022 08:22:46.417 INFO [main] org.apache.coyote.AbstractProtocol.destroy Destroying ProtocolHandler ["http-nio-127.0.0.1-auto-6"]
07-Dec-2022 08:22:46.418 INFO [main] org.apache.catalina.startup.LoggingBaseTest.setUp Starting test case [testSetLocale04]
07-Dec-2022 08:22:46.418 INFO [main] org.apache.coyote.AbstractProtocol.destroy Destroying ProtocolHandler ["http-nio-127.0.0.1-auto-7"]
07-Dec-2022 08:22:46.419 INFO [main] org.apache.catalina.startup.LoggingBaseTest.setUp Starting test case [testSetLocale05]
07-Dec-2022 08:22:46.420 WARNING [main] org.apache.catalina.connector.Response.setLocale The encoding [unknown] is not recognised by the JRE
	java.lang.IllegalArgumentException: java.io.UnsupportedEncodingException: The character encoding [unknown] is not supported
		at org.apache.coyote.Response.setCharacterEncoding(Response.java:485)
		at org.apache.catalina.connector.Response.setLocale(Response.java:882)
		at org.apache.catalina.connector.TestResponse.testSetLocale05(TestResponse.java:894)
		at java.base/jdk.internal.reflect.NativeMethodAccessorImpl.invoke0(Native Method)
		at java.base/jdk.internal.reflect.NativeMethodAccessorImpl.invoke(NativeMethodAccessorImpl.java:62)
		at java.base/jdk.internal.reflect.DelegatingMethodAccessorImpl.invoke(DelegatingMethodAccessorImpl.java:43)
		at java.base/java.lang.reflect.Method.invoke(Method.java:566)
		at org.junit.runners.model.FrameworkMethod$1.runReflectiveCall(FrameworkMethod.java:59)
		at org.junit.internal.runners.model.ReflectiveCallable.run(ReflectiveCallable.java:12)
		at org.junit.runners.model.FrameworkMethod.invokeExplosively(FrameworkMethod.java:61)
		at org.junit.internal.runners.statements.InvokeMethod.evaluate(InvokeMethod.java:17)
		at org.junit.internal.runners.statements.ExpectException.evaluate(ExpectException.java:19)
		at org.junit.internal.runners.statements.RunBefores.evaluate(RunBefores.java:26)
		at org.junit.internal.runners.statements.RunAfters.evaluate(RunAfters.java:27)
		at org.junit.rules.TestWatcher$1.evaluate(TestWatcher.java:61)
		at org.junit.runners.ParentRunner$3.evaluate(ParentRunner.java:306)
		at org.junit.runners.BlockJUnit4ClassRunner$1.evaluate(BlockJUnit4ClassRunner.java:100)
		at org.junit.runners.ParentRunner.runLeaf(ParentRunner.java:366)
		at org.junit.runners.BlockJUnit4ClassRunner.runChild(BlockJUnit4ClassRunner.java:103)
		at org.junit.runners.BlockJUnit4ClassRunner.runChild(BlockJUnit4ClassRunner.java:63)
		at org.junit.runners.ParentRunner$4.run(ParentRunner.java:331)
		at org.junit.runners.ParentRunner$1.schedule(ParentRunner.java:79)
		at org.junit.runners.ParentRunner.runChildren(ParentRunner.java:329)
		at org.junit.runners.ParentRunner.access$100(ParentRunner.java:66)
		at org.junit.runners.ParentRunner$2.evaluate(ParentRunner.java:293)
		at org.junit.internal.runners.statements.RunBefores.evaluate(RunBefores.java:26)
		at org.junit.internal.runners.statements.RunAfters.evaluate(RunAfters.java:27)
		at org.junit.runners.ParentRunner$3.evaluate(ParentRunner.java:306)
		at org.junit.runners.ParentRunner.run(ParentRunner.java:413)
		at junit.framework.JUnit4TestAdapter.run(JUnit4TestAdapter.java:50)
		at org.apache.tools.ant.taskdefs.optional.junit.JUnitTestRunner.run(JUnitTestRunner.java:535)
		at org.apache.tools.ant.taskdefs.optional.junit.JUnitTestRunner.launch(JUnitTestRunner.java:1197)
		at org.apache.tools.ant.taskdefs.optional.junit.JUnitTestRunner.main(JUnitTestRunner.java:1042)
	Caused by: java.io.UnsupportedEncodingException: The character encoding [unknown] is not supported
		at org.apache.tomcat.util.buf.B2CConverter.getCharsetLower(B2CConverter.java:87)
		at org.apache.tomcat.util.buf.B2CConverter.getCharset(B2CConverter.java:62)
		at org.apache.coyote.Response.setCharacterEncoding(Response.java:483)
		... 32 more
07-Dec-2022 08:22:46.421 WARNING [main] org.apache.catalina.connector.Response.setCharacterEncoding The encoding [unknown] is not recognised by the JRE
	java.lang.IllegalArgumentException: java.io.UnsupportedEncodingException: The character encoding [unknown] is not supported
		at org.apache.coyote.Response.setCharacterEncoding(Response.java:485)
		at org.apache.catalina.connector.Response.setCharacterEncoding(Response.java:825)
		at org.apache.catalina.connector.Response.getWriter(Response.java:605)
		at org.apache.catalina.connector.TestResponse.testSetLocale05(TestResponse.java:896)
		at java.base/jdk.internal.reflect.NativeMethodAccessorImpl.invoke0(Native Method)
		at java.base/jdk.internal.reflect.NativeMethodAccessorImpl.invoke(NativeMethodAccessorImpl.java:62)
		at java.base/jdk.internal.reflect.DelegatingMethodAccessorImpl.invoke(DelegatingMethodAccessorImpl.java:43)
		at java.base/java.lang.reflect.Method.invoke(Method.java:566)
		at org.junit.runners.model.FrameworkMethod$1.runReflectiveCall(FrameworkMethod.java:59)
		at org.junit.internal.runners.model.ReflectiveCallable.run(ReflectiveCallable.java:12)
		at org.junit.runners.model.FrameworkMethod.invokeExplosively(FrameworkMethod.java:61)
		at org.junit.internal.runners.statements.InvokeMethod.evaluate(InvokeMethod.java:17)
		at org.junit.internal.runners.statements.ExpectException.evaluate(ExpectException.java:19)
		at org.junit.internal.runners.statements.RunBefores.evaluate(RunBefores.java:26)
		at org.junit.internal.runners.statements.RunAfters.evaluate(RunAfters.java:27)
		at org.junit.rules.TestWatcher$1.evaluate(TestWatcher.java:61)
		at org.junit.runners.ParentRunner$3.evaluate(ParentRunner.java:306)
		at org.junit.runners.BlockJUnit4ClassRunner$1.evaluate(BlockJUnit4ClassRunner.java:100)
		at org.junit.runners.ParentRunner.runLeaf(ParentRunner.java:366)
		at org.junit.runners.BlockJUnit4ClassRunner.runChild(BlockJUnit4ClassRunner.java:103)
		at org.junit.runners.BlockJUnit4ClassRunner.runChild(BlockJUnit4ClassRunner.java:63)
		at org.junit.runners.ParentRunner$4.run(ParentRunner.java:331)
		at org.junit.runners.ParentRunner$1.schedule(ParentRunner.java:79)
		at org.junit.runners.ParentRunner.runChildren(ParentRunner.java:329)
		at org.junit.runners.ParentRunner.access$100(ParentRunner.java:66)
		at org.junit.runners.ParentRunner$2.evaluate(ParentRunner.java:293)
		at org.junit.internal.runners.statements.RunBefores.evaluate(RunBefores.java:26)
		at org.junit.internal.runners.statements.RunAfters.evaluate(RunAfters.java:27)
		at org.junit.runners.ParentRunner$3.evaluate(ParentRunner.java:306)
		at org.junit.runners.ParentRunner.run(ParentRunner.java:413)
		at junit.framework.JUnit4TestAdapter.run(JUnit4TestAdapter.java:50)
		at org.apache.tools.ant.taskdefs.optional.junit.JUnitTestRunner.run(JUnitTestRunner.java:535)
		at org.apache.tools.ant.taskdefs.optional.junit.JUnitTestRunner.launch(JUnitTestRunner.java:1197)
		at org.apache.tools.ant.taskdefs.optional.junit.JUnitTestRunner.main(JUnitTestRunner.java:1042)
	Caused by: java.io.UnsupportedEncodingException: The character encoding [unknown] is not supported
		at org.apache.tomcat.util.buf.B2CConverter.getCharsetLower(B2CConverter.java:87)
		at org.apache.tomcat.util.buf.B2CConverter.getCharset(B2CConverter.java:62)
		at org.apache.coyote.Response.setCharacterEncoding(Response.java:483)
		... 33 more
07-Dec-2022 08:22:46.423 INFO [main] org.apache.coyote.AbstractProtocol.destroy Destroying ProtocolHandler ["http-nio-127.0.0.1-auto-8"]
07-Dec-2022 08:22:46.423 INFO [main] org.apache.catalina.startup.LoggingBaseTest.setUp Starting test case [testSetLocale06]
07-Dec-2022 08:22:46.424 WARNING [main] org.apache.catalina.connector.Response.setLocale The encoding [unknown] is not recognised by the JRE
	java.lang.IllegalArgumentException: java.io.UnsupportedEncodingException: The character encoding [unknown] is not supported
		at org.apache.coyote.Response.setCharacterEncoding(Response.java:485)
		at org.apache.catalina.connector.Response.setLocale(Response.java:882)
		at org.apache.catalina.connector.TestResponse.testSetLocale06(TestResponse.java:906)
		at java.base/jdk.internal.reflect.NativeMethodAccessorImpl.invoke0(Native Method)
		at java.base/jdk.internal.reflect.NativeMethodAccessorImpl.invoke(NativeMethodAccessorImpl.java:62)
		at java.base/jdk.internal.reflect.DelegatingMethodAccessorImpl.invoke(DelegatingMethodAccessorImpl.java:43)
		at java.base/java.lang.reflect.Method.invoke(Method.java:566)
		at org.junit.runners.model.FrameworkMethod$1.runReflectiveCall(FrameworkMethod.java:59)
		at org.junit.internal.runners.model.ReflectiveCallable.run(ReflectiveCallable.java:12)
		at org.junit.runners.model.FrameworkMethod.invokeExplosively(FrameworkMethod.java:61)
		at org.junit.internal.runners.statements.InvokeMethod.evaluate(InvokeMethod.java:17)
		at org.junit.internal.runners.statements.RunBefores.evaluate(RunBefores.java:26)
		at org.junit.internal.runners.statements.RunAfters.evaluate(RunAfters.java:27)
		at org.junit.rules.TestWatcher$1.evaluate(TestWatcher.java:61)
		at org.junit.runners.ParentRunner$3.evaluate(ParentRunner.java:306)
		at org.junit.runners.BlockJUnit4ClassRunner$1.evaluate(BlockJUnit4ClassRunner.java:100)
		at org.junit.runners.ParentRunner.runLeaf(ParentRunner.java:366)
		at org.junit.runners.BlockJUnit4ClassRunner.runChild(BlockJUnit4ClassRunner.java:103)
		at org.junit.runners.BlockJUnit4ClassRunner.runChild(BlockJUnit4ClassRunner.java:63)
		at org.junit.runners.ParentRunner$4.run(ParentRunner.java:331)
		at org.junit.runners.ParentRunner$1.schedule(ParentRunner.java:79)
		at org.junit.runners.ParentRunner.runChildren(ParentRunner.java:329)
		at org.junit.runners.ParentRunner.access$100(ParentRunner.java:66)
		at org.junit.runners.ParentRunner$2.evaluate(ParentRunner.java:293)
		at org.junit.internal.runners.statements.RunBefores.evaluate(RunBefores.java:26)
		at org.junit.internal.runners.statements.RunAfters.evaluate(RunAfters.java:27)
		at org.junit.runners.ParentRunner$3.evaluate(ParentRunner.java:306)
		at org.junit.runners.ParentRunner.run(ParentRunner.java:413)
		at junit.framework.JUnit4TestAdapter.run(JUnit4TestAdapter.java:50)
		at org.apache.tools.ant.taskdefs.optional.junit.JUnitTestRunner.run(JUnitTestRunner.java:535)
		at org.apache.tools.ant.taskdefs.optional.junit.JUnitTestRunner.launch(JUnitTestRunner.java:1197)
		at org.apache.tools.ant.taskdefs.optional.junit.JUnitTestRunner.main(JUnitTestRunner.java:1042)
	Caused by: java.io.UnsupportedEncodingException: The character encoding [unknown] is not supported
		at org.apache.tomcat.util.buf.B2CConverter.getCharsetLower(B2CConverter.java:87)
		at org.apache.tomcat.util.buf.B2CConverter.getCharset(B2CConverter.java:62)
		at org.apache.coyote.Response.setCharacterEncoding(Response.java:483)
		... 31 more
07-Dec-2022 08:22:46.425 INFO [main] org.apache.coyote.AbstractProtocol.destroy Destroying ProtocolHandler ["http-nio-127.0.0.1-auto-9"]
07-Dec-2022 08:22:46.426 INFO [main] org.apache.catalina.startup.LoggingBaseTest.setUp Starting test case [testSetLocale07]
07-Dec-2022 08:22:46.426 INFO [main] org.apache.coyote.AbstractProtocol.destroy Destroying ProtocolHandler ["http-nio-127.0.0.1-auto-10"]
07-Dec-2022 08:22:46.427 INFO [main] org.apache.catalina.startup.LoggingBaseTest.setUp Starting test case [testSetLocale08]
07-Dec-2022 08:22:46.430 INFO [main] org.apache.coyote.AbstractProtocol.destroy Destroying ProtocolHandler ["http-nio-127.0.0.1-auto-11"]
07-Dec-2022 08:22:46.430 INFO [main] org.apache.catalina.startup.LoggingBaseTest.setUp Starting test case [testBug49598]
07-Dec-2022 08:22:46.667 INFO [main] org.apache.coyote.AbstractProtocol.init Initializing ProtocolHandler ["http-nio-127.0.0.1-auto-12"]
07-Dec-2022 08:22:46.684 INFO [main] org.apache.catalina.core.StandardService.startInternal Starting service [Tomcat]
07-Dec-2022 08:22:46.684 INFO [main] org.apache.catalina.core.StandardEngine.startInternal Starting Servlet engine: [Apache Tomcat/8.5.85-dev]
07-Dec-2022 08:22:46.758 INFO [main] org.apache.coyote.AbstractProtocol.start Starting ProtocolHandler ["http-nio-127.0.0.1-auto-12-37887"]
07-Dec-2022 08:22:46.823 INFO [main] org.apache.coyote.AbstractProtocol.pause Pausing ProtocolHandler ["http-nio-127.0.0.1-auto-12-37887"]
07-Dec-2022 08:22:46.824 INFO [main] org.apache.catalina.core.StandardService.stopInternal Stopping service [Tomcat]
07-Dec-2022 08:22:46.836 INFO [main] org.apache.coyote.AbstractProtocol.stop Stopping ProtocolHandler ["http-nio-127.0.0.1-auto-12-37887"]
07-Dec-2022 08:22:46.847 INFO [main] org.apache.coyote.AbstractProtocol.destroy Destroying ProtocolHandler ["http-nio-127.0.0.1-auto-12-37887"]
07-Dec-2022 08:22:46.849 INFO [main] org.apache.catalina.startup.LoggingBaseTest.setUp Starting test case [testBug52811]
07-Dec-2022 08:22:46.851 INFO [main] org.apache.coyote.AbstractProtocol.init Initializing ProtocolHandler ["http-nio-127.0.0.1-auto-13"]
07-Dec-2022 08:22:46.851 INFO [main] org.apache.catalina.core.StandardService.startInternal Starting service [Tomcat]
07-Dec-2022 08:22:46.851 INFO [main] org.apache.catalina.core.StandardEngine.startInternal Starting Servlet engine: [Apache Tomcat/8.5.85-dev]
07-Dec-2022 08:22:46.861 INFO [main] org.apache.coyote.AbstractProtocol.start Starting ProtocolHandler ["http-nio-127.0.0.1-auto-13-46239"]
07-Dec-2022 08:22:46.877 INFO [main] org.apache.coyote.AbstractProtocol.pause Pausing ProtocolHandler ["http-nio-127.0.0.1-auto-13-46239"]
07-Dec-2022 08:22:46.880 INFO [main] org.apache.catalina.core.StandardService.stopInternal Stopping service [Tomcat]
07-Dec-2022 08:22:46.882 INFO [main] org.apache.coyote.AbstractProtocol.stop Stopping ProtocolHandler ["http-nio-127.0.0.1-auto-13-46239"]
07-Dec-2022 08:22:46.890 INFO [main] org.apache.coyote.AbstractProtocol.destroy Destroying ProtocolHandler ["http-nio-127.0.0.1-auto-13-46239"]
07-Dec-2022 08:22:46.892 INFO [main] org.apache.catalina.startup.LoggingBaseTest.setUp Starting test case [testSetContentType01]
07-Dec-2022 08:22:46.893 INFO [main] org.apache.coyote.AbstractProtocol.destroy Destroying ProtocolHandler ["http-nio-127.0.0.1-auto-14"]
07-Dec-2022 08:22:46.894 INFO [main] org.apache.catalina.startup.LoggingBaseTest.setUp Starting test case [testSetContentType02]
07-Dec-2022 08:22:46.894 INFO [main] org.apache.coyote.AbstractProtocol.destroy Destroying ProtocolHandler ["http-nio-127.0.0.1-auto-15"]
07-Dec-2022 08:22:46.895 INFO [main] org.apache.catalina.startup.LoggingBaseTest.setUp Starting test case [testSetContentType03]
07-Dec-2022 08:22:46.896 INFO [main] org.apache.coyote.AbstractProtocol.destroy Destroying ProtocolHandler ["http-nio-127.0.0.1-auto-16"]
07-Dec-2022 08:22:46.897 INFO [main] org.apache.catalina.startup.LoggingBaseTest.setUp Starting test case [testSetContentType04]
07-Dec-2022 08:22:46.897 INFO [main] org.apache.coyote.AbstractProtocol.destroy Destroying ProtocolHandler ["http-nio-127.0.0.1-auto-17"]
07-Dec-2022 08:22:46.898 INFO [main] org.apache.catalina.startup.LoggingBaseTest.setUp Starting test case [testSetContentType05]
07-Dec-2022 08:22:46.898 WARNING [main] org.apache.catalina.connector.Response.setContentType The encoding [unknown] is not recognised by the JRE
	java.lang.IllegalArgumentException: java.io.UnsupportedEncodingException: The character encoding [unknown] is not supported
		at org.apache.coyote.Response.setCharacterEncoding(Response.java:485)
		at org.apache.catalina.connector.Response.setContentType(Response.java:788)
		at org.apache.catalina.connector.TestResponse.testSetContentType05(TestResponse.java:816)
		at java.base/jdk.internal.reflect.NativeMethodAccessorImpl.invoke0(Native Method)
		at java.base/jdk.internal.reflect.NativeMethodAccessorImpl.invoke(NativeMethodAccessorImpl.java:62)
		at java.base/jdk.internal.reflect.DelegatingMethodAccessorImpl.invoke(DelegatingMethodAccessorImpl.java:43)
		at java.base/java.lang.reflect.Method.invoke(Method.java:566)
		at org.junit.runners.model.FrameworkMethod$1.runReflectiveCall(FrameworkMethod.java:59)
		at org.junit.internal.runners.model.ReflectiveCallable.run(ReflectiveCallable.java:12)
		at org.junit.runners.model.FrameworkMethod.invokeExplosively(FrameworkMethod.java:61)
		at org.junit.internal.runners.statements.InvokeMethod.evaluate(InvokeMethod.java:17)
		at org.junit.internal.runners.statements.ExpectException.evaluate(ExpectException.java:19)
		at org.junit.internal.runners.statements.RunBefores.evaluate(RunBefores.java:26)
		at org.junit.internal.runners.statements.RunAfters.evaluate(RunAfters.java:27)
		at org.junit.rules.TestWatcher$1.evaluate(TestWatcher.java:61)
		at org.junit.runners.ParentRunner$3.evaluate(ParentRunner.java:306)
		at org.junit.runners.BlockJUnit4ClassRunner$1.evaluate(BlockJUnit4ClassRunner.java:100)
		at org.junit.runners.ParentRunner.runLeaf(ParentRunner.java:366)
		at org.junit.runners.BlockJUnit4ClassRunner.runChild(BlockJUnit4ClassRunner.java:103)
		at org.junit.runners.BlockJUnit4ClassRunner.runChild(BlockJUnit4ClassRunner.java:63)
		at org.junit.runners.ParentRunner$4.run(ParentRunner.java:331)
		at org.junit.runners.ParentRunner$1.schedule(ParentRunner.java:79)
		at org.junit.runners.ParentRunner.runChildren(ParentRunner.java:329)
		at org.junit.runners.ParentRunner.access$100(ParentRunner.java:66)
		at org.junit.runners.ParentRunner$2.evaluate(ParentRunner.java:293)
		at org.junit.internal.runners.statements.RunBefores.evaluate(RunBefores.java:26)
		at org.junit.internal.runners.statements.RunAfters.evaluate(RunAfters.java:27)
		at org.junit.runners.ParentRunner$3.evaluate(ParentRunner.java:306)
		at org.junit.runners.ParentRunner.run(ParentRunner.java:413)
		at junit.framework.JUnit4TestAdapter.run(JUnit4TestAdapter.java:50)
		at org.apache.tools.ant.taskdefs.optional.junit.JUnitTestRunner.run(JUnitTestRunner.java:535)
		at org.apache.tools.ant.taskdefs.optional.junit.JUnitTestRunner.launch(JUnitTestRunner.java:1197)
		at org.apache.tools.ant.taskdefs.optional.junit.JUnitTestRunner.main(JUnitTestRunner.java:1042)
	Caused by: java.io.UnsupportedEncodingException: The character encoding [unknown] is not supported
		at org.apache.tomcat.util.buf.B2CConverter.getCharsetLower(B2CConverter.java:87)
		at org.apache.tomcat.util.buf.B2CConverter.getCharset(B2CConverter.java:62)
		at org.apache.coyote.Response.setCharacterEncoding(Response.java:483)
		... 32 more
07-Dec-2022 08:22:46.899 WARNING [main] org.apache.catalina.connector.Response.setCharacterEncoding The encoding [unknown] is not recognised by the JRE

Continuation...

	java.lang.IllegalArgumentException: java.io.UnsupportedEncodingException: The character encoding [unknown] is not supported
		at org.apache.coyote.Response.setCharacterEncoding(Response.java:485)
		at org.apache.catalina.connector.Response.setCharacterEncoding(Response.java:825)
		at org.apache.catalina.connector.Response.getWriter(Response.java:605)
		at org.apache.catalina.connector.TestResponse.testSetContentType05(TestResponse.java:818)
		at java.base/jdk.internal.reflect.NativeMethodAccessorImpl.invoke0(Native Method)
		at java.base/jdk.internal.reflect.NativeMethodAccessorImpl.invoke(NativeMethodAccessorImpl.java:62)
		at java.base/jdk.internal.reflect.DelegatingMethodAccessorImpl.invoke(DelegatingMethodAccessorImpl.java:43)
		at java.base/java.lang.reflect.Method.invoke(Method.java:566)
		at org.junit.runners.model.FrameworkMethod$1.runReflectiveCall(FrameworkMethod.java:59)
		at org.junit.internal.runners.model.ReflectiveCallable.run(ReflectiveCallable.java:12)
		at org.junit.runners.model.FrameworkMethod.invokeExplosively(FrameworkMethod.java:61)
		at org.junit.internal.runners.statements.InvokeMethod.evaluate(InvokeMethod.java:17)
		at org.junit.internal.runners.statements.ExpectException.evaluate(ExpectException.java:19)
		at org.junit.internal.runners.statements.RunBefores.evaluate(RunBefores.java:26)
		at org.junit.internal.runners.statements.RunAfters.evaluate(RunAfters.java:27)
		at org.junit.rules.TestWatcher$1.evaluate(TestWatcher.java:61)
		at org.junit.runners.ParentRunner$3.evaluate(ParentRunner.java:306)
		at org.junit.runners.BlockJUnit4ClassRunner$1.evaluate(BlockJUnit4ClassRunner.java:100)
		at org.junit.runners.ParentRunner.runLeaf(ParentRunner.java:366)
		at org.junit.runners.BlockJUnit4ClassRunner.runChild(BlockJUnit4ClassRunner.java:103)
		at org.junit.runners.BlockJUnit4ClassRunner.runChild(BlockJUnit4ClassRunner.java:63)
		at org.junit.runners.ParentRunner$4.run(ParentRunner.java:331)
		at org.junit.runners.ParentRunner$1.schedule(ParentRunner.java:79)
		at org.junit.runners.ParentRunner.runChildren(ParentRunner.java:329)
		at org.junit.runners.ParentRunner.access$100(ParentRunner.java:66)
		at org.junit.runners.ParentRunner$2.evaluate(ParentRunner.java:293)
		at org.junit.internal.runners.statements.RunBefores.evaluate(RunBefores.java:26)
		at org.junit.internal.runners.statements.RunAfters.evaluate(RunAfters.java:27)
		at org.junit.runners.ParentRunner$3.evaluate(ParentRunner.java:306)
		at org.junit.runners.ParentRunner.run(ParentRunner.java:413)
		at junit.framework.JUnit4TestAdapter.run(JUnit4TestAdapter.java:50)
		at org.apache.tools.ant.taskdefs.optional.junit.JUnitTestRunner.run(JUnitTestRunner.java:535)
		at org.apache.tools.ant.taskdefs.optional.junit.JUnitTestRunner.launch(JUnitTestRunner.java:1197)
		at org.apache.tools.ant.taskdefs.optional.junit.JUnitTestRunner.main(JUnitTestRunner.java:1042)
	Caused by: java.io.UnsupportedEncodingException: The character encoding [unknown] is not supported
		at org.apache.tomcat.util.buf.B2CConverter.getCharsetLower(B2CConverter.java:87)
		at org.apache.tomcat.util.buf.B2CConverter.getCharset(B2CConverter.java:62)
		at org.apache.coyote.Response.setCharacterEncoding(Response.java:483)
		... 33 more
07-Dec-2022 08:22:46.900 INFO [main] org.apache.coyote.AbstractProtocol.destroy Destroying ProtocolHandler ["http-nio-127.0.0.1-auto-18"]
07-Dec-2022 08:22:46.900 INFO [main] org.apache.catalina.startup.LoggingBaseTest.setUp Starting test case [testSetContentType06]
07-Dec-2022 08:22:46.901 WARNING [main] org.apache.catalina.connector.Response.setContentType The encoding [unknown] is not recognised by the JRE
	java.lang.IllegalArgumentException: java.io.UnsupportedEncodingException: The character encoding [unknown] is not supported
		at org.apache.coyote.Response.setCharacterEncoding(Response.java:485)
		at org.apache.catalina.connector.Response.setContentType(Response.java:788)
		at org.apache.catalina.connector.TestResponse.testSetContentType06(TestResponse.java:828)
		at java.base/jdk.internal.reflect.NativeMethodAccessorImpl.invoke0(Native Method)
		at java.base/jdk.internal.reflect.NativeMethodAccessorImpl.invoke(NativeMethodAccessorImpl.java:62)
		at java.base/jdk.internal.reflect.DelegatingMethodAccessorImpl.invoke(DelegatingMethodAccessorImpl.java:43)
		at java.base/java.lang.reflect.Method.invoke(Method.java:566)
		at org.junit.runners.model.FrameworkMethod$1.runReflectiveCall(FrameworkMethod.java:59)
		at org.junit.internal.runners.model.ReflectiveCallable.run(ReflectiveCallable.java:12)
		at org.junit.runners.model.FrameworkMethod.invokeExplosively(FrameworkMethod.java:61)
		at org.junit.internal.runners.statements.InvokeMethod.evaluate(InvokeMethod.java:17)
		at org.junit.internal.runners.statements.RunBefores.evaluate(RunBefores.java:26)
		at org.junit.internal.runners.statements.RunAfters.evaluate(RunAfters.java:27)
		at org.junit.rules.TestWatcher$1.evaluate(TestWatcher.java:61)
		at org.junit.runners.ParentRunner$3.evaluate(ParentRunner.java:306)
		at org.junit.runners.BlockJUnit4ClassRunner$1.evaluate(BlockJUnit4ClassRunner.java:100)
		at org.junit.runners.ParentRunner.runLeaf(ParentRunner.java:366)
		at org.junit.runners.BlockJUnit4ClassRunner.runChild(BlockJUnit4ClassRunner.java:103)
		at org.junit.runners.BlockJUnit4ClassRunner.runChild(BlockJUnit4ClassRunner.java:63)
		at org.junit.runners.ParentRunner$4.run(ParentRunner.java:331)
		at org.junit.runners.ParentRunner$1.schedule(ParentRunner.java:79)
		at org.junit.runners.ParentRunner.runChildren(ParentRunner.java:329)
		at org.junit.runners.ParentRunner.access$100(ParentRunner.java:66)
		at org.junit.runners.ParentRunner$2.evaluate(ParentRunner.java:293)
		at org.junit.internal.runners.statements.RunBefores.evaluate(RunBefores.java:26)
		at org.junit.internal.runners.statements.RunAfters.evaluate(RunAfters.java:27)
		at org.junit.runners.ParentRunner$3.evaluate(ParentRunner.java:306)
		at org.junit.runners.ParentRunner.run(ParentRunner.java:413)
		at junit.framework.JUnit4TestAdapter.run(JUnit4TestAdapter.java:50)
		at org.apache.tools.ant.taskdefs.optional.junit.JUnitTestRunner.run(JUnitTestRunner.java:535)
		at org.apache.tools.ant.taskdefs.optional.junit.JUnitTestRunner.launch(JUnitTestRunner.java:1197)
		at org.apache.tools.ant.taskdefs.optional.junit.JUnitTestRunner.main(JUnitTestRunner.java:1042)
	Caused by: java.io.UnsupportedEncodingException: The character encoding [unknown] is not supported
		at org.apache.tomcat.util.buf.B2CConverter.getCharsetLower(B2CConverter.java:87)
		at org.apache.tomcat.util.buf.B2CConverter.getCharset(B2CConverter.java:62)
		at org.apache.coyote.Response.setCharacterEncoding(Response.java:483)
		... 31 more
07-Dec-2022 08:22:46.902 INFO [main] org.apache.coyote.AbstractProtocol.destroy Destroying ProtocolHandler ["http-nio-127.0.0.1-auto-19"]
07-Dec-2022 08:22:46.902 INFO [main] org.apache.catalina.startup.LoggingBaseTest.setUp Starting test case [testBug53062a]
07-Dec-2022 08:22:46.904 INFO [main] org.apache.coyote.AbstractProtocol.destroy Destroying ProtocolHandler ["http-nio-127.0.0.1-auto-20"]
07-Dec-2022 08:22:46.904 INFO [main] org.apache.catalina.startup.LoggingBaseTest.setUp Starting test case [testBug53062b]
07-Dec-2022 08:22:46.905 INFO [main] org.apache.coyote.AbstractProtocol.destroy Destroying ProtocolHandler ["http-nio-127.0.0.1-auto-21"]
07-Dec-2022 08:22:46.906 INFO [main] org.apache.catalina.startup.LoggingBaseTest.setUp Starting test case [testBug53062c]
07-Dec-2022 08:22:46.907 INFO [main] org.apache.coyote.AbstractProtocol.destroy Destroying ProtocolHandler ["http-nio-127.0.0.1-auto-22"]
07-Dec-2022 08:22:46.907 INFO [main] org.apache.catalina.startup.LoggingBaseTest.setUp Starting test case [testBug53062d]
07-Dec-2022 08:22:46.908 INFO [main] org.apache.coyote.AbstractProtocol.destroy Destroying ProtocolHandler ["http-nio-127.0.0.1-auto-23"]
07-Dec-2022 08:22:46.908 INFO [main] org.apache.catalina.startup.LoggingBaseTest.setUp Starting test case [testBug53062e]
07-Dec-2022 08:22:46.908 INFO [main] org.apache.coyote.AbstractProtocol.destroy Destroying ProtocolHandler ["http-nio-127.0.0.1-auto-24"]
07-Dec-2022 08:22:46.909 INFO [main] org.apache.catalina.startup.LoggingBaseTest.setUp Starting test case [testBug53062f]
07-Dec-2022 08:22:46.909 INFO [main] org.apache.coyote.AbstractProtocol.destroy Destroying ProtocolHandler ["http-nio-127.0.0.1-auto-25"]
07-Dec-2022 08:22:46.910 INFO [main] org.apache.catalina.startup.LoggingBaseTest.setUp Starting test case [testBug53062g]
07-Dec-2022 08:22:46.910 INFO [main] org.apache.coyote.AbstractProtocol.destroy Destroying ProtocolHandler ["http-nio-127.0.0.1-auto-26"]
07-Dec-2022 08:22:46.910 INFO [main] org.apache.catalina.startup.LoggingBaseTest.setUp Starting test case [testBug53062h]
07-Dec-2022 08:22:46.911 INFO [main] org.apache.coyote.AbstractProtocol.destroy Destroying ProtocolHandler ["http-nio-127.0.0.1-auto-27"]
07-Dec-2022 08:22:46.911 INFO [main] org.apache.catalina.startup.LoggingBaseTest.setUp Starting test case [testBug53062i]
07-Dec-2022 08:22:46.912 INFO [main] org.apache.coyote.AbstractProtocol.destroy Destroying ProtocolHandler ["http-nio-127.0.0.1-auto-28"]
07-Dec-2022 08:22:46.912 INFO [main] org.apache.catalina.startup.LoggingBaseTest.setUp Starting test case [testBug53062j]
07-Dec-2022 08:22:46.913 INFO [main] org.apache.coyote.AbstractProtocol.destroy Destroying ProtocolHandler ["http-nio-127.0.0.1-auto-29"]
07-Dec-2022 08:22:46.913 INFO [main] org.apache.catalina.startup.LoggingBaseTest.setUp Starting test case [testBug53062k]
07-Dec-2022 08:22:46.913 INFO [main] org.apache.coyote.AbstractProtocol.destroy Destroying ProtocolHandler ["http-nio-127.0.0.1-auto-30"]
07-Dec-2022 08:22:46.914 INFO [main] org.apache.catalina.startup.LoggingBaseTest.setUp Starting test case [testBug53062l]
07-Dec-2022 08:22:46.914 INFO [main] org.apache.coyote.AbstractProtocol.destroy Destroying ProtocolHandler ["http-nio-127.0.0.1-auto-31"]
07-Dec-2022 08:22:46.915 INFO [main] org.apache.catalina.startup.LoggingBaseTest.setUp Starting test case [testBug53062m]
07-Dec-2022 08:22:46.915 INFO [main] org.apache.coyote.AbstractProtocol.destroy Destroying ProtocolHandler ["http-nio-127.0.0.1-auto-32"]
07-Dec-2022 08:22:46.916 INFO [main] org.apache.catalina.startup.LoggingBaseTest.setUp Starting test case [testBug53062n]
07-Dec-2022 08:22:46.916 INFO [main] org.apache.coyote.AbstractProtocol.destroy Destroying ProtocolHandler ["http-nio-127.0.0.1-auto-33"]
07-Dec-2022 08:22:46.917 INFO [main] org.apache.catalina.startup.LoggingBaseTest.setUp Starting test case [testBug53062o]
07-Dec-2022 08:22:46.917 INFO [main] org.apache.coyote.AbstractProtocol.destroy Destroying ProtocolHandler ["http-nio-127.0.0.1-auto-34"]
07-Dec-2022 08:22:46.918 INFO [main] org.apache.catalina.startup.LoggingBaseTest.setUp Starting test case [testBug53062p]
07-Dec-2022 08:22:46.918 INFO [main] org.apache.coyote.AbstractProtocol.destroy Destroying ProtocolHandler ["http-nio-127.0.0.1-auto-35"]
07-Dec-2022 08:22:46.918 INFO [main] org.apache.catalina.startup.LoggingBaseTest.setUp Starting test case [testBug53469a]
07-Dec-2022 08:22:46.919 INFO [main] org.apache.coyote.AbstractProtocol.destroy Destroying ProtocolHandler ["http-nio-127.0.0.1-auto-36"]
07-Dec-2022 08:22:46.919 INFO [main] org.apache.catalina.startup.LoggingBaseTest.setUp Starting test case [testBug53469b]
07-Dec-2022 08:22:46.920 INFO [main] org.apache.coyote.AbstractProtocol.destroy Destroying ProtocolHandler ["http-nio-127.0.0.1-auto-37"]
07-Dec-2022 08:22:46.920 INFO [main] org.apache.catalina.startup.LoggingBaseTest.setUp Starting test case [testCharset]
07-Dec-2022 08:22:46.922 INFO [main] org.apache.coyote.AbstractProtocol.init Initializing ProtocolHandler ["http-nio-127.0.0.1-auto-38"]
07-Dec-2022 08:22:46.922 INFO [main] org.apache.catalina.core.StandardService.startInternal Starting service [Tomcat]
07-Dec-2022 08:22:46.922 INFO [main] org.apache.catalina.core.StandardEngine.startInternal Starting Servlet engine: [Apache Tomcat/8.5.85-dev]
07-Dec-2022 08:22:46.927 INFO [main] org.apache.coyote.AbstractProtocol.start Starting ProtocolHandler ["http-nio-127.0.0.1-auto-38-39483"]
07-Dec-2022 08:22:46.932 INFO [main] org.apache.coyote.AbstractProtocol.pause Pausing ProtocolHandler ["http-nio-127.0.0.1-auto-38-39483"]
07-Dec-2022 08:22:46.933 INFO [main] org.apache.catalina.core.StandardService.stopInternal Stopping service [Tomcat]
07-Dec-2022 08:22:46.939 INFO [main] org.apache.coyote.AbstractProtocol.stop Stopping ProtocolHandler ["http-nio-127.0.0.1-auto-38-39483"]
07-Dec-2022 08:22:46.941 INFO [main] org.apache.coyote.AbstractProtocol.destroy Destroying ProtocolHandler ["http-nio-127.0.0.1-auto-38-39483"]
07-Dec-2022 08:22:46.943 INFO [main] org.apache.catalina.startup.LoggingBaseTest.setUp Starting test case [testSetCharacterEncoding01]
07-Dec-2022 08:22:46.943 INFO [main] org.apache.coyote.AbstractProtocol.destroy Destroying ProtocolHandler ["http-nio-127.0.0.1-auto-39"]
07-Dec-2022 08:22:46.944 INFO [main] org.apache.catalina.startup.LoggingBaseTest.setUp Starting test case [testSetCharacterEncoding02]
07-Dec-2022 08:22:46.944 INFO [main] org.apache.coyote.AbstractProtocol.destroy Destroying ProtocolHandler ["http-nio-127.0.0.1-auto-40"]
07-Dec-2022 08:22:46.945 INFO [main] org.apache.catalina.startup.LoggingBaseTest.setUp Starting test case [testSetCharacterEncoding03]
07-Dec-2022 08:22:46.945 INFO [main] org.apache.coyote.AbstractProtocol.destroy Destroying ProtocolHandler ["http-nio-127.0.0.1-auto-41"]
07-Dec-2022 08:22:46.946 INFO [main] org.apache.catalina.startup.LoggingBaseTest.setUp Starting test case [testSetCharacterEncoding04]
07-Dec-2022 08:22:46.946 INFO [main] org.apache.coyote.AbstractProtocol.destroy Destroying ProtocolHandler ["http-nio-127.0.0.1-auto-42"]
07-Dec-2022 08:22:46.946 INFO [main] org.apache.catalina.startup.LoggingBaseTest.setUp Starting test case [testSetCharacterEncoding05]
07-Dec-2022 08:22:46.947 INFO [main] org.apache.coyote.AbstractProtocol.destroy Destroying ProtocolHandler ["http-nio-127.0.0.1-auto-43"]
07-Dec-2022 08:22:46.947 INFO [main] org.apache.catalina.startup.LoggingBaseTest.setUp Starting test case [testSetCharacterEncoding06]
07-Dec-2022 08:22:46.948 WARNING [main] org.apache.catalina.connector.Response.setCharacterEncoding The encoding [unknown] is not recognised by the JRE
	java.lang.IllegalArgumentException: java.io.UnsupportedEncodingException: The character encoding [unknown] is not supported
		at org.apache.coyote.Response.setCharacterEncoding(Response.java:485)
		at org.apache.catalina.connector.Response.setCharacterEncoding(Response.java:825)
		at org.apache.catalina.connector.TestResponse.testSetCharacterEncoding06(TestResponse.java:720)
		at java.base/jdk.internal.reflect.NativeMethodAccessorImpl.invoke0(Native Method)
		at java.base/jdk.internal.reflect.NativeMethodAccessorImpl.invoke(NativeMethodAccessorImpl.java:62)
		at java.base/jdk.internal.reflect.DelegatingMethodAccessorImpl.invoke(DelegatingMethodAccessorImpl.java:43)
		at java.base/java.lang.reflect.Method.invoke(Method.java:566)
		at org.junit.runners.model.FrameworkMethod$1.runReflectiveCall(FrameworkMethod.java:59)
		at org.junit.internal.runners.model.ReflectiveCallable.run(ReflectiveCallable.java:12)
		at org.junit.runners.model.FrameworkMethod.invokeExplosively(FrameworkMethod.java:61)
		at org.junit.internal.runners.statements.InvokeMethod.evaluate(InvokeMethod.java:17)
		at org.junit.internal.runners.statements.ExpectException.evaluate(ExpectException.java:19)
		at org.junit.internal.runners.statements.RunBefores.evaluate(RunBefores.java:26)
		at org.junit.internal.runners.statements.RunAfters.evaluate(RunAfters.java:27)
		at org.junit.rules.TestWatcher$1.evaluate(TestWatcher.java:61)
		at org.junit.runners.ParentRunner$3.evaluate(ParentRunner.java:306)
		at org.junit.runners.BlockJUnit4ClassRunner$1.evaluate(BlockJUnit4ClassRunner.java:100)
		at org.junit.runners.ParentRunner.runLeaf(ParentRunner.java:366)
		at org.junit.runners.BlockJUnit4ClassRunner.runChild(BlockJUnit4ClassRunner.java:103)
		at org.junit.runners.BlockJUnit4ClassRunner.runChild(BlockJUnit4ClassRunner.java:63)
		at org.junit.runners.ParentRunner$4.run(ParentRunner.java:331)
		at org.junit.runners.ParentRunner$1.schedule(ParentRunner.java:79)
		at org.junit.runners.ParentRunner.runChildren(ParentRunner.java:329)
		at org.junit.runners.ParentRunner.access$100(ParentRunner.java:66)
		at org.junit.runners.ParentRunner$2.evaluate(ParentRunner.java:293)
		at org.junit.internal.runners.statements.RunBefores.evaluate(RunBefores.java:26)
		at org.junit.internal.runners.statements.RunAfters.evaluate(RunAfters.java:27)
		at org.junit.runners.ParentRunner$3.evaluate(ParentRunner.java:306)
		at org.junit.runners.ParentRunner.run(ParentRunner.java:413)
		at junit.framework.JUnit4TestAdapter.run(JUnit4TestAdapter.java:50)
		at org.apache.tools.ant.taskdefs.optional.junit.JUnitTestRunner.run(JUnitTestRunner.java:535)
		at org.apache.tools.ant.taskdefs.optional.junit.JUnitTestRunner.launch(JUnitTestRunner.java:1197)
		at org.apache.tools.ant.taskdefs.optional.junit.JUnitTestRunner.main(JUnitTestRunner.java:1042)
	Caused by: java.io.UnsupportedEncodingException: The character encoding [unknown] is not supported
		at org.apache.tomcat.util.buf.B2CConverter.getCharsetLower(B2CConverter.java:87)
		at org.apache.tomcat.util.buf.B2CConverter.getCharset(B2CConverter.java:62)
		at org.apache.coyote.Response.setCharacterEncoding(Response.java:483)
		... 32 more
07-Dec-2022 08:22:46.948 WARNING [main] org.apache.catalina.connector.Response.setCharacterEncoding The encoding [unknown] is not recognised by the JRE
	java.lang.IllegalArgumentException: java.io.UnsupportedEncodingException: The character encoding [unknown] is not supported
		at org.apache.coyote.Response.setCharacterEncoding(Response.java:485)
		at org.apache.catalina.connector.Response.setCharacterEncoding(Response.java:825)
		at org.apache.catalina.connector.Response.getWriter(Response.java:605)
		at org.apache.catalina.connector.TestResponse.testSetCharacterEncoding06(TestResponse.java:722)
		at java.base/jdk.internal.reflect.NativeMethodAccessorImpl.invoke0(Native Method)
		at java.base/jdk.internal.reflect.NativeMethodAccessorImpl.invoke(NativeMethodAccessorImpl.java:62)
		at java.base/jdk.internal.reflect.DelegatingMethodAccessorImpl.invoke(DelegatingMethodAccessorImpl.java:43)
		at java.base/java.lang.reflect.Method.invoke(Method.java:566)
		at org.junit.runners.model.FrameworkMethod$1.runReflectiveCall(FrameworkMethod.java:59)
		at org.junit.internal.runners.model.ReflectiveCallable.run(ReflectiveCallable.java:12)
		at org.junit.runners.model.FrameworkMethod.invokeExplosively(FrameworkMethod.java:61)
		at org.junit.internal.runners.statements.InvokeMethod.evaluate(InvokeMethod.java:17)
		at org.junit.internal.runners.statements.ExpectException.evaluate(ExpectException.java:19)
		at org.junit.internal.runners.statements.RunBefores.evaluate(RunBefores.java:26)
		at org.junit.internal.runners.statements.RunAfters.evaluate(RunAfters.java:27)
		at org.junit.rules.TestWatcher$1.evaluate(TestWatcher.java:61)
		at org.junit.runners.ParentRunner$3.evaluate(ParentRunner.java:306)
		at org.junit.runners.BlockJUnit4ClassRunner$1.evaluate(BlockJUnit4ClassRunner.java:100)
		at org.junit.runners.ParentRunner.runLeaf(ParentRunner.java:366)
		at org.junit.runners.BlockJUnit4ClassRunner.runChild(BlockJUnit4ClassRunner.java:103)
		at org.junit.runners.BlockJUnit4ClassRunner.runChild(BlockJUnit4ClassRunner.java:63)
		at org.junit.runners.ParentRunner$4.run(ParentRunner.java:331)
		at org.junit.runners.ParentRunner$1.schedule(ParentRunner.java:79)
		at org.junit.runners.ParentRunner.runChildren(ParentRunner.java:329)
		at org.junit.runners.ParentRunner.access$100(ParentRunner.java:66)
		at org.junit.runners.ParentRunner$2.evaluate(ParentRunner.java:293)

Continuation...

		at org.junit.internal.runners.statements.RunBefores.evaluate(RunBefores.java:26)
		at org.junit.internal.runners.statements.RunAfters.evaluate(RunAfters.java:27)
		at org.junit.runners.ParentRunner$3.evaluate(ParentRunner.java:306)
		at org.junit.runners.ParentRunner.run(ParentRunner.java:413)
		at junit.framework.JUnit4TestAdapter.run(JUnit4TestAdapter.java:50)
		at org.apache.tools.ant.taskdefs.optional.junit.JUnitTestRunner.run(JUnitTestRunner.java:535)
		at org.apache.tools.ant.taskdefs.optional.junit.JUnitTestRunner.launch(JUnitTestRunner.java:1197)
		at org.apache.tools.ant.taskdefs.optional.junit.JUnitTestRunner.main(JUnitTestRunner.java:1042)
	Caused by: java.io.UnsupportedEncodingException: The character encoding [unknown] is not supported
		at org.apache.tomcat.util.buf.B2CConverter.getCharsetLower(B2CConverter.java:87)
		at org.apache.tomcat.util.buf.B2CConverter.getCharset(B2CConverter.java:62)
		at org.apache.coyote.Response.setCharacterEncoding(Response.java:483)
		... 33 more
07-Dec-2022 08:22:46.949 INFO [main] org.apache.coyote.AbstractProtocol.destroy Destroying ProtocolHandler ["http-nio-127.0.0.1-auto-44"]
07-Dec-2022 08:22:46.949 INFO [main] org.apache.catalina.startup.LoggingBaseTest.setUp Starting test case [testSetCharacterEncoding07]
07-Dec-2022 08:22:46.950 WARNING [main] org.apache.catalina.connector.Response.setCharacterEncoding The encoding [unknown] is not recognised by the JRE
	java.lang.IllegalArgumentException: java.io.UnsupportedEncodingException: The character encoding [unknown] is not supported
		at org.apache.coyote.Response.setCharacterEncoding(Response.java:485)
		at org.apache.catalina.connector.Response.setCharacterEncoding(Response.java:825)
		at org.apache.catalina.connector.TestResponse.testSetCharacterEncoding07(TestResponse.java:732)
		at java.base/jdk.internal.reflect.NativeMethodAccessorImpl.invoke0(Native Method)
		at java.base/jdk.internal.reflect.NativeMethodAccessorImpl.invoke(NativeMethodAccessorImpl.java:62)
		at java.base/jdk.internal.reflect.DelegatingMethodAccessorImpl.invoke(DelegatingMethodAccessorImpl.java:43)
		at java.base/java.lang.reflect.Method.invoke(Method.java:566)
		at org.junit.runners.model.FrameworkMethod$1.runReflectiveCall(FrameworkMethod.java:59)
		at org.junit.internal.runners.model.ReflectiveCallable.run(ReflectiveCallable.java:12)
		at org.junit.runners.model.FrameworkMethod.invokeExplosively(FrameworkMethod.java:61)
		at org.junit.internal.runners.statements.InvokeMethod.evaluate(InvokeMethod.java:17)
		at org.junit.internal.runners.statements.RunBefores.evaluate(RunBefores.java:26)
		at org.junit.internal.runners.statements.RunAfters.evaluate(RunAfters.java:27)
		at org.junit.rules.TestWatcher$1.evaluate(TestWatcher.java:61)
		at org.junit.runners.ParentRunner$3.evaluate(ParentRunner.java:306)
		at org.junit.runners.BlockJUnit4ClassRunner$1.evaluate(BlockJUnit4ClassRunner.java:100)
		at org.junit.runners.ParentRunner.runLeaf(ParentRunner.java:366)
		at org.junit.runners.BlockJUnit4ClassRunner.runChild(BlockJUnit4ClassRunner.java:103)
		at org.junit.runners.BlockJUnit4ClassRunner.runChild(BlockJUnit4ClassRunner.java:63)
		at org.junit.runners.ParentRunner$4.run(ParentRunner.java:331)
		at org.junit.runners.ParentRunner$1.schedule(ParentRunner.java:79)
		at org.junit.runners.ParentRunner.runChildren(ParentRunner.java:329)
		at org.junit.runners.ParentRunner.access$100(ParentRunner.java:66)
		at org.junit.runners.ParentRunner$2.evaluate(ParentRunner.java:293)
		at org.junit.internal.runners.statements.RunBefores.evaluate(RunBefores.java:26)
		at org.junit.internal.runners.statements.RunAfters.evaluate(RunAfters.java:27)
		at org.junit.runners.ParentRunner$3.evaluate(ParentRunner.java:306)
		at org.junit.runners.ParentRunner.run(ParentRunner.java:413)
		at junit.framework.JUnit4TestAdapter.run(JUnit4TestAdapter.java:50)
		at org.apache.tools.ant.taskdefs.optional.junit.JUnitTestRunner.run(JUnitTestRunner.java:535)
		at org.apache.tools.ant.taskdefs.optional.junit.JUnitTestRunner.launch(JUnitTestRunner.java:1197)
		at org.apache.tools.ant.taskdefs.optional.junit.JUnitTestRunner.main(JUnitTestRunner.java:1042)
	Caused by: java.io.UnsupportedEncodingException: The character encoding [unknown] is not supported
		at org.apache.tomcat.util.buf.B2CConverter.getCharsetLower(B2CConverter.java:87)
		at org.apache.tomcat.util.buf.B2CConverter.getCharset(B2CConverter.java:62)
		at org.apache.coyote.Response.setCharacterEncoding(Response.java:483)
		... 31 more
07-Dec-2022 08:22:46.951 INFO [main] org.apache.coyote.AbstractProtocol.destroy Destroying ProtocolHandler ["http-nio-127.0.0.1-auto-45"]
07-Dec-2022 08:22:46.951 INFO [main] org.apache.catalina.startup.LoggingBaseTest.setUp Starting test case [testSetCharacterEncoding08]
07-Dec-2022 08:22:46.951 INFO [main] org.apache.coyote.AbstractProtocol.destroy Destroying ProtocolHandler ["http-nio-127.0.0.1-auto-46"]
07-Dec-2022 08:22:46.954 INFO [main] org.apache.catalina.startup.LoggingBaseTest.setUp Starting test case [testEncodeURL01]
07-Dec-2022 08:22:46.955 INFO [main] org.apache.coyote.AbstractProtocol.destroy Destroying ProtocolHandler ["http-nio-127.0.0.1-auto-47"]
07-Dec-2022 08:22:46.955 INFO [main] org.apache.catalina.startup.LoggingBaseTest.setUp Starting test case [testEncodeURL02]
07-Dec-2022 08:22:46.961 INFO [main] org.apache.coyote.AbstractProtocol.destroy Destroying ProtocolHandler ["http-nio-127.0.0.1-auto-48"]
07-Dec-2022 08:22:46.961 INFO [main] org.apache.catalina.startup.LoggingBaseTest.setUp Starting test case [testEncodeURL03]
07-Dec-2022 08:22:46.962 INFO [main] org.apache.coyote.AbstractProtocol.destroy Destroying ProtocolHandler ["http-nio-127.0.0.1-auto-49"]
07-Dec-2022 08:22:46.962 INFO [main] org.apache.catalina.startup.LoggingBaseTest.setUp Starting test case [testEncodeURL04]
07-Dec-2022 08:22:46.963 INFO [main] org.apache.coyote.AbstractProtocol.destroy Destroying ProtocolHandler ["http-nio-127.0.0.1-auto-50"]
07-Dec-2022 08:22:46.963 INFO [main] org.apache.catalina.startup.LoggingBaseTest.setUp Starting test case [testEncodeURL06]
07-Dec-2022 08:22:46.964 INFO [main] org.apache.coyote.AbstractProtocol.destroy Destroying ProtocolHandler ["http-nio-127.0.0.1-auto-51"]
07-Dec-2022 08:22:46.964 INFO [main] org.apache.catalina.startup.LoggingBaseTest.setUp Starting test case [testEncodeURL07]
07-Dec-2022 08:22:46.965 INFO [main] org.apache.coyote.AbstractProtocol.destroy Destroying ProtocolHandler ["http-nio-127.0.0.1-auto-52"]
07-Dec-2022 08:22:46.965 INFO [main] org.apache.catalina.startup.LoggingBaseTest.setUp Starting test case [testEncodeURL08]
07-Dec-2022 08:22:46.965 INFO [main] org.apache.coyote.AbstractProtocol.destroy Destroying ProtocolHandler ["http-nio-127.0.0.1-auto-53"]
07-Dec-2022 08:22:46.966 INFO [main] org.apache.catalina.startup.LoggingBaseTest.setUp Starting test case [testEncodeURL09]
07-Dec-2022 08:22:46.966 INFO [main] org.apache.coyote.AbstractProtocol.destroy Destroying ProtocolHandler ["http-nio-127.0.0.1-auto-54"]
07-Dec-2022 08:22:46.967 INFO [main] org.apache.catalina.startup.LoggingBaseTest.setUp Starting test case [testEncodeURL10]
07-Dec-2022 08:22:46.967 INFO [main] org.apache.coyote.AbstractProtocol.destroy Destroying ProtocolHandler ["http-nio-127.0.0.1-auto-55"]
07-Dec-2022 08:22:46.968 INFO [main] org.apache.catalina.startup.LoggingBaseTest.setUp Starting test case [testEncodeURL11]
07-Dec-2022 08:22:46.968 INFO [main] org.apache.coyote.AbstractProtocol.destroy Destroying ProtocolHandler ["http-nio-127.0.0.1-auto-56"]
07-Dec-2022 08:22:46.968 INFO [main] org.apache.catalina.startup.LoggingBaseTest.setUp Starting test case [testEncodeURL12]
07-Dec-2022 08:22:46.969 INFO [main] org.apache.coyote.AbstractProtocol.destroy Destroying ProtocolHandler ["http-nio-127.0.0.1-auto-57"]
07-Dec-2022 08:22:46.969 INFO [main] org.apache.catalina.startup.LoggingBaseTest.setUp Starting test case [testEncodeURL13]
07-Dec-2022 08:22:46.970 INFO [main] org.apache.coyote.AbstractProtocol.destroy Destroying ProtocolHandler ["http-nio-127.0.0.1-auto-58"]
07-Dec-2022 08:22:46.970 INFO [main] org.apache.catalina.startup.LoggingBaseTest.setUp Starting test case [testEncodeURL14]
07-Dec-2022 08:22:46.971 INFO [main] org.apache.coyote.AbstractProtocol.destroy Destroying ProtocolHandler ["http-nio-127.0.0.1-auto-59"]
07-Dec-2022 08:22:46.971 INFO [main] org.apache.catalina.startup.LoggingBaseTest.setUp Starting test case [testEncodeURL15]
07-Dec-2022 08:22:46.972 INFO [main] org.apache.coyote.AbstractProtocol.destroy Destroying ProtocolHandler ["http-nio-127.0.0.1-auto-60"]
07-Dec-2022 08:22:46.973 INFO [main] org.apache.catalina.startup.LoggingBaseTest.setUp Starting test case [testEncodeURL16]
07-Dec-2022 08:22:46.973 INFO [main] org.apache.coyote.AbstractProtocol.destroy Destroying ProtocolHandler ["http-nio-127.0.0.1-auto-61"]
07-Dec-2022 08:22:46.974 INFO [main] org.apache.catalina.startup.LoggingBaseTest.setUp Starting test case [testEncodeRedirectURL01]
07-Dec-2022 08:22:46.974 INFO [main] org.apache.coyote.AbstractProtocol.destroy Destroying ProtocolHandler ["http-nio-127.0.0.1-auto-62"]
07-Dec-2022 08:22:46.975 INFO [main] org.apache.catalina.startup.LoggingBaseTest.setUp Starting test case [testEncodeRedirectURL02]
07-Dec-2022 08:22:46.975 INFO [main] org.apache.coyote.AbstractProtocol.destroy Destroying ProtocolHandler ["http-nio-127.0.0.1-auto-63"]
07-Dec-2022 08:22:46.975 INFO [main] org.apache.catalina.startup.LoggingBaseTest.setUp Starting test case [testEncodeRedirectURL03]
07-Dec-2022 08:22:46.976 INFO [main] org.apache.coyote.AbstractProtocol.destroy Destroying ProtocolHandler ["http-nio-127.0.0.1-auto-64"]
07-Dec-2022 08:22:46.976 INFO [main] org.apache.catalina.startup.LoggingBaseTest.setUp Starting test case [testEncodeRedirectURL04]
07-Dec-2022 08:22:46.977 INFO [main] org.apache.coyote.AbstractProtocol.destroy Destroying ProtocolHandler ["http-nio-127.0.0.1-auto-65"]
07-Dec-2022 08:22:46.977 INFO [main] org.apache.catalina.startup.LoggingBaseTest.setUp Starting test case [testEncodeRedirectURL05]
07-Dec-2022 08:22:46.978 INFO [main] org.apache.coyote.AbstractProtocol.destroy Destroying ProtocolHandler ["http-nio-127.0.0.1-auto-66"]
07-Dec-2022 08:22:46.978 INFO [main] org.apache.catalina.startup.LoggingBaseTest.setUp Starting test case [testEncodeRedirectURL06]
07-Dec-2022 08:22:46.979 INFO [main] org.apache.coyote.AbstractProtocol.destroy Destroying ProtocolHandler ["http-nio-127.0.0.1-auto-67"]
07-Dec-2022 08:22:46.979 INFO [main] org.apache.catalina.startup.LoggingBaseTest.setUp Starting test case [testEncodeRedirectURL07]
07-Dec-2022 08:22:46.979 INFO [main] org.apache.coyote.AbstractProtocol.destroy Destroying ProtocolHandler ["http-nio-127.0.0.1-auto-68"]
07-Dec-2022 08:22:46.980 INFO [main] org.apache.catalina.startup.LoggingBaseTest.setUp Starting test case [testEncodeRedirectURL08]
07-Dec-2022 08:22:46.980 INFO [main] org.apache.coyote.AbstractProtocol.destroy Destroying ProtocolHandler ["http-nio-127.0.0.1-auto-69"]
07-Dec-2022 08:22:46.981 INFO [main] org.apache.catalina.startup.LoggingBaseTest.setUp Starting test case [testEncodeRedirectURL09]
07-Dec-2022 08:22:46.981 INFO [main] org.apache.coyote.AbstractProtocol.destroy Destroying ProtocolHandler ["http-nio-127.0.0.1-auto-70"]
07-Dec-2022 08:22:46.981 INFO [main] org.apache.catalina.startup.LoggingBaseTest.setUp Starting test case [testEncodeRedirectURL10]
07-Dec-2022 08:22:46.982 INFO [main] org.apache.coyote.AbstractProtocol.destroy Destroying ProtocolHandler ["http-nio-127.0.0.1-auto-71"]
07-Dec-2022 08:22:46.982 INFO [main] org.apache.catalina.startup.LoggingBaseTest.setUp Starting test case [testEncodeRedirectURL11]
07-Dec-2022 08:22:46.983 INFO [main] org.apache.coyote.AbstractProtocol.destroy Destroying ProtocolHandler ["http-nio-127.0.0.1-auto-72"]
07-Dec-2022 08:22:46.984 INFO [main] org.apache.catalina.startup.LoggingBaseTest.setUp Starting test case [testEncodeRedirectURL12]
07-Dec-2022 08:22:46.984 INFO [main] org.apache.coyote.AbstractProtocol.destroy Destroying ProtocolHandler ["http-nio-127.0.0.1-auto-73"]
07-Dec-2022 08:22:46.985 INFO [main] org.apache.catalina.startup.LoggingBaseTest.setUp Starting test case [testEncodeRedirectURL13]
07-Dec-2022 08:22:46.986 INFO [main] org.apache.coyote.AbstractProtocol.destroy Destroying ProtocolHandler ["http-nio-127.0.0.1-auto-74"]
07-Dec-2022 08:22:46.986 INFO [main] org.apache.catalina.startup.LoggingBaseTest.setUp Starting test case [testEncodeRedirectURL14]
07-Dec-2022 08:22:46.987 INFO [main] org.apache.coyote.AbstractProtocol.destroy Destroying ProtocolHandler ["http-nio-127.0.0.1-auto-75"]
07-Dec-2022 08:22:46.987 INFO [main] org.apache.catalina.startup.LoggingBaseTest.setUp Starting test case [testEncodeRedirectURL15]
07-Dec-2022 08:22:46.988 INFO [main] org.apache.coyote.AbstractProtocol.destroy Destroying ProtocolHandler ["http-nio-127.0.0.1-auto-76"]
07-Dec-2022 08:22:46.989 INFO [main] org.apache.catalina.startup.LoggingBaseTest.setUp Starting test case [testEncodeRedirectURL16]
07-Dec-2022 08:22:46.990 INFO [main] org.apache.coyote.AbstractProtocol.destroy Destroying ProtocolHandler ["http-nio-127.0.0.1-auto-77"]
------------- ---------------- ---------------

Testcase: testSendRedirect01 took 0.209 sec
Testcase: testSendRedirect02 took 0.001 sec
Testcase: testSendRedirect03 took 0.002 sec
Testcase: testSetLocale01 took 0.004 sec
Testcase: testSetLocale02 took 0.002 sec
Testcase: testSetLocale03 took 0.001 sec
Testcase: testSetLocale04 took 0.002 sec
Testcase: testSetLocale05 took 0.004 sec
Testcase: testSetLocale06 took 0.002 sec
Testcase: testSetLocale07 took 0.001 sec
Testcase: testSetLocale08 took 0.004 sec
Testcase: testBug49598 took 0.419 sec
Testcase: testBug52811 took 0.043 sec
Testcase: testSetContentType01 took 0.001 sec
Testcase: testSetContentType02 took 0.001 sec
Testcase: testSetContentType03 took 0.002 sec
Testcase: testSetContentType04 took 0 sec
Testcase: testSetContentType05 took 0.002 sec
Testcase: testSetContentType06 took 0.002 sec
Testcase: testBug53062a took 0.002 sec
Testcase: testBug53062b took 0.001 sec
Testcase: testBug53062c took 0.001 sec
Testcase: testBug53062d took 0.001 sec
Testcase: testBug53062e took 0 sec
Testcase: testBug53062f took 0 sec
Testcase: testBug53062g took 0.001 sec
Testcase: testBug53062h took 0.001 sec
Testcase: testBug53062i took 0.001 sec
Testcase: testBug53062j took 0.001 sec
Testcase: testBug53062k took 0.001 sec
Testcase: testBug53062l took 0 sec
Testcase: testBug53062m took 0 sec
Testcase: testBug53062n took 0 sec
Testcase: testBug53062o took 0 sec
Testcase: testBug53062p took 0.001 sec
Testcase: testBug53469a took 0.001 sec
Testcase: testBug53469b took 0.001 sec
Testcase: testCharset took 0.022 sec
Testcase: testSetCharacterEncoding01 took 0.001 sec
Testcase: testSetCharacterEncoding02 took 0 sec
Testcase: testSetCharacterEncoding03 took 0 sec
Testcase: testSetCharacterEncoding04 took 0.001 sec
Testcase: testSetCharacterEncoding05 took 0.001 sec
Testcase: testSetCharacterEncoding06 took 0.002 sec
Testcase: testSetCharacterEncoding07 took 0.002 sec
Testcase: testSetCharacterEncoding08 took 0.001 sec
Testcase: testEncodeURL01 took 0.003 sec
Testcase: testEncodeURL02 took 0.006 sec
Testcase: testEncodeURL03 took 0.001 sec
Testcase: testEncodeURL04 took 0.001 sec
Testcase: testEncodeURL06 took 0.001 sec
Testcase: testEncodeURL07 took 0.001 sec
Testcase: testEncodeURL08 took 0.001 sec
Testcase: testEncodeURL09 took 0 sec
Testcase: testEncodeURL10 took 0 sec
Testcase: testEncodeURL11 took 0.001 sec
Testcase: testEncodeURL12 took 0.001 sec
Testcase: testEncodeURL13 took 0.001 sec
Testcase: testEncodeURL14 took 0.001 sec
Testcase: testEncodeURL15 took 0.001 sec
Testcase: testEncodeURL16 took 0 sec
Testcase: testEncodeRedirectURL01 took 0 sec
Testcase: testEncodeRedirectURL02 took 0.001 sec
Testcase: testEncodeRedirectURL03 took 0.001 sec
Testcase: testEncodeRedirectURL04 took 0.001 sec
Testcase: testEncodeRedirectURL05 took 0.001 sec
Testcase: testEncodeRedirectURL06 took 0.001 sec
Testcase: testEncodeRedirectURL07 took 0.001 sec
Testcase: testEncodeRedirectURL08 took 0 sec
Testcase: testEncodeRedirectURL09 took 0 sec
Testcase: testEncodeRedirectURL10 took 0.001 sec
Testcase: testEncodeRedirectURL11 took 0.001 sec
Testcase: testEncodeRedirectURL12 took 0.001 sec
Testcase: testEncodeRedirectURL13 took 0.001 sec
Testcase: testEncodeRedirectURL14 took 0.001 sec
Testcase: testEncodeRedirectURL15 took 0.001 sec
Testcase: testEncodeRedirectURL16 took 0.001 sec

Apache Gump, Gump, Apache, the Apache feather logo, and the Apache Gump project logos are trademarks of The Apache Software Foundation.

Last Updated: Wed, 07 Dec 2022 06:00:08 ().Python Logo