Run| Workspace| Log| Issues| Fixes| Pre-reqs| Stats| XRef| Maven Repository Proxy Log Gump Logo

Details

File Contents

Testsuite: org.apache.catalina.connector.TestResponse
Tests run: 77, Failures: 0, Errors: 0, Skipped: 0, Time elapsed: 1.11 sec
------------- Standard Error -----------------
17-Oct-2021 10:02:34.349 INFO [main] org.apache.catalina.startup.LoggingBaseTest.setUp Starting test case [testSendRedirect01]
17-Oct-2021 10:02:34.454 INFO [main] org.apache.coyote.AbstractProtocol.destroy Destroying ProtocolHandler ["http-apr-127.0.0.1-auto-1"]
17-Oct-2021 10:02:34.459 INFO [main] org.apache.catalina.startup.LoggingBaseTest.setUp Starting test case [testSendRedirect02]
17-Oct-2021 10:02:34.461 INFO [main] org.apache.coyote.AbstractProtocol.destroy Destroying ProtocolHandler ["http-apr-127.0.0.1-auto-2"]
17-Oct-2021 10:02:34.462 INFO [main] org.apache.catalina.startup.LoggingBaseTest.setUp Starting test case [testSendRedirect03]
17-Oct-2021 10:02:34.463 INFO [main] org.apache.coyote.AbstractProtocol.destroy Destroying ProtocolHandler ["http-apr-127.0.0.1-auto-3"]
17-Oct-2021 10:02:34.463 INFO [main] org.apache.catalina.startup.LoggingBaseTest.setUp Starting test case [testSetLocale01]
17-Oct-2021 10:02:34.468 INFO [main] org.apache.coyote.AbstractProtocol.destroy Destroying ProtocolHandler ["http-apr-127.0.0.1-auto-4"]
17-Oct-2021 10:02:34.468 INFO [main] org.apache.catalina.startup.LoggingBaseTest.setUp Starting test case [testSetLocale02]
17-Oct-2021 10:02:34.470 INFO [main] org.apache.coyote.AbstractProtocol.destroy Destroying ProtocolHandler ["http-apr-127.0.0.1-auto-5"]
17-Oct-2021 10:02:34.470 INFO [main] org.apache.catalina.startup.LoggingBaseTest.setUp Starting test case [testSetLocale03]
17-Oct-2021 10:02:34.472 INFO [main] org.apache.coyote.AbstractProtocol.destroy Destroying ProtocolHandler ["http-apr-127.0.0.1-auto-6"]
17-Oct-2021 10:02:34.472 INFO [main] org.apache.catalina.startup.LoggingBaseTest.setUp Starting test case [testSetLocale04]
17-Oct-2021 10:02:34.473 INFO [main] org.apache.coyote.AbstractProtocol.destroy Destroying ProtocolHandler ["http-apr-127.0.0.1-auto-7"]
17-Oct-2021 10:02:34.474 INFO [main] org.apache.catalina.startup.LoggingBaseTest.setUp Starting test case [testSetLocale05]
17-Oct-2021 10:02:34.475 WARNING [main] org.apache.catalina.connector.Response.setLocale The encoding [unknown] is not recognised by the JRE
	java.lang.IllegalArgumentException: java.io.UnsupportedEncodingException: The character encoding [unknown] is not supported
		at org.apache.coyote.Response.setCharacterEncoding(Response.java:485)
		at org.apache.catalina.connector.Response.setLocale(Response.java:880)
		at org.apache.catalina.connector.TestResponse.testSetLocale05(TestResponse.java:894)
		at java.base/jdk.internal.reflect.NativeMethodAccessorImpl.invoke0(Native Method)
		at java.base/jdk.internal.reflect.NativeMethodAccessorImpl.invoke(NativeMethodAccessorImpl.java:62)
		at java.base/jdk.internal.reflect.DelegatingMethodAccessorImpl.invoke(DelegatingMethodAccessorImpl.java:43)
		at java.base/java.lang.reflect.Method.invoke(Method.java:566)
		at org.junit.runners.model.FrameworkMethod$1.runReflectiveCall(FrameworkMethod.java:59)
		at org.junit.internal.runners.model.ReflectiveCallable.run(ReflectiveCallable.java:12)
		at org.junit.runners.model.FrameworkMethod.invokeExplosively(FrameworkMethod.java:61)
		at org.junit.internal.runners.statements.InvokeMethod.evaluate(InvokeMethod.java:17)
		at org.junit.internal.runners.statements.ExpectException.evaluate(ExpectException.java:19)
		at org.junit.internal.runners.statements.RunBefores.evaluate(RunBefores.java:26)
		at org.junit.internal.runners.statements.RunAfters.evaluate(RunAfters.java:27)
		at org.junit.rules.TestWatcher$1.evaluate(TestWatcher.java:61)
		at org.junit.runners.ParentRunner$3.evaluate(ParentRunner.java:306)
		at org.junit.runners.BlockJUnit4ClassRunner$1.evaluate(BlockJUnit4ClassRunner.java:100)
		at org.junit.runners.ParentRunner.runLeaf(ParentRunner.java:366)
		at org.junit.runners.BlockJUnit4ClassRunner.runChild(BlockJUnit4ClassRunner.java:103)
		at org.junit.runners.BlockJUnit4ClassRunner.runChild(BlockJUnit4ClassRunner.java:63)
		at org.junit.runners.ParentRunner$4.run(ParentRunner.java:331)
		at org.junit.runners.ParentRunner$1.schedule(ParentRunner.java:79)
		at org.junit.runners.ParentRunner.runChildren(ParentRunner.java:329)
		at org.junit.runners.ParentRunner.access$100(ParentRunner.java:66)
		at org.junit.runners.ParentRunner$2.evaluate(ParentRunner.java:293)
		at org.junit.internal.runners.statements.RunBefores.evaluate(RunBefores.java:26)
		at org.junit.internal.runners.statements.RunAfters.evaluate(RunAfters.java:27)
		at org.junit.runners.ParentRunner$3.evaluate(ParentRunner.java:306)
		at org.junit.runners.ParentRunner.run(ParentRunner.java:413)
		at junit.framework.JUnit4TestAdapter.run(JUnit4TestAdapter.java:50)
		at org.apache.tools.ant.taskdefs.optional.junit.JUnitTestRunner.run(JUnitTestRunner.java:535)
		at org.apache.tools.ant.taskdefs.optional.junit.JUnitTestRunner.launch(JUnitTestRunner.java:1197)
		at org.apache.tools.ant.taskdefs.optional.junit.JUnitTestRunner.main(JUnitTestRunner.java:1042)
	Caused by: java.io.UnsupportedEncodingException: The character encoding [unknown] is not supported
		at org.apache.tomcat.util.buf.B2CConverter.getCharsetLower(B2CConverter.java:87)
		at org.apache.tomcat.util.buf.B2CConverter.getCharset(B2CConverter.java:62)
		at org.apache.coyote.Response.setCharacterEncoding(Response.java:483)
		... 32 more
17-Oct-2021 10:02:34.476 WARNING [main] org.apache.catalina.connector.Response.setCharacterEncoding The encoding [unknown] is not recognised by the JRE
	java.lang.IllegalArgumentException: java.io.UnsupportedEncodingException: The character encoding [unknown] is not supported
		at org.apache.coyote.Response.setCharacterEncoding(Response.java:485)
		at org.apache.catalina.connector.Response.setCharacterEncoding(Response.java:823)
		at org.apache.catalina.connector.Response.getWriter(Response.java:603)
		at org.apache.catalina.connector.TestResponse.testSetLocale05(TestResponse.java:896)
		at java.base/jdk.internal.reflect.NativeMethodAccessorImpl.invoke0(Native Method)
		at java.base/jdk.internal.reflect.NativeMethodAccessorImpl.invoke(NativeMethodAccessorImpl.java:62)
		at java.base/jdk.internal.reflect.DelegatingMethodAccessorImpl.invoke(DelegatingMethodAccessorImpl.java:43)
		at java.base/java.lang.reflect.Method.invoke(Method.java:566)
		at org.junit.runners.model.FrameworkMethod$1.runReflectiveCall(FrameworkMethod.java:59)
		at org.junit.internal.runners.model.ReflectiveCallable.run(ReflectiveCallable.java:12)
		at org.junit.runners.model.FrameworkMethod.invokeExplosively(FrameworkMethod.java:61)
		at org.junit.internal.runners.statements.InvokeMethod.evaluate(InvokeMethod.java:17)
		at org.junit.internal.runners.statements.ExpectException.evaluate(ExpectException.java:19)
		at org.junit.internal.runners.statements.RunBefores.evaluate(RunBefores.java:26)
		at org.junit.internal.runners.statements.RunAfters.evaluate(RunAfters.java:27)
		at org.junit.rules.TestWatcher$1.evaluate(TestWatcher.java:61)
		at org.junit.runners.ParentRunner$3.evaluate(ParentRunner.java:306)
		at org.junit.runners.BlockJUnit4ClassRunner$1.evaluate(BlockJUnit4ClassRunner.java:100)
		at org.junit.runners.ParentRunner.runLeaf(ParentRunner.java:366)
		at org.junit.runners.BlockJUnit4ClassRunner.runChild(BlockJUnit4ClassRunner.java:103)
		at org.junit.runners.BlockJUnit4ClassRunner.runChild(BlockJUnit4ClassRunner.java:63)
		at org.junit.runners.ParentRunner$4.run(ParentRunner.java:331)
		at org.junit.runners.ParentRunner$1.schedule(ParentRunner.java:79)
		at org.junit.runners.ParentRunner.runChildren(ParentRunner.java:329)
		at org.junit.runners.ParentRunner.access$100(ParentRunner.java:66)
		at org.junit.runners.ParentRunner$2.evaluate(ParentRunner.java:293)
		at org.junit.internal.runners.statements.RunBefores.evaluate(RunBefores.java:26)
		at org.junit.internal.runners.statements.RunAfters.evaluate(RunAfters.java:27)
		at org.junit.runners.ParentRunner$3.evaluate(ParentRunner.java:306)
		at org.junit.runners.ParentRunner.run(ParentRunner.java:413)
		at junit.framework.JUnit4TestAdapter.run(JUnit4TestAdapter.java:50)
		at org.apache.tools.ant.taskdefs.optional.junit.JUnitTestRunner.run(JUnitTestRunner.java:535)
		at org.apache.tools.ant.taskdefs.optional.junit.JUnitTestRunner.launch(JUnitTestRunner.java:1197)
		at org.apache.tools.ant.taskdefs.optional.junit.JUnitTestRunner.main(JUnitTestRunner.java:1042)
	Caused by: java.io.UnsupportedEncodingException: The character encoding [unknown] is not supported
		at org.apache.tomcat.util.buf.B2CConverter.getCharsetLower(B2CConverter.java:87)
		at org.apache.tomcat.util.buf.B2CConverter.getCharset(B2CConverter.java:62)
		at org.apache.coyote.Response.setCharacterEncoding(Response.java:483)
		... 33 more
17-Oct-2021 10:02:34.477 INFO [main] org.apache.coyote.AbstractProtocol.destroy Destroying ProtocolHandler ["http-apr-127.0.0.1-auto-8"]
17-Oct-2021 10:02:34.478 INFO [main] org.apache.catalina.startup.LoggingBaseTest.setUp Starting test case [testSetLocale06]
17-Oct-2021 10:02:34.478 WARNING [main] org.apache.catalina.connector.Response.setLocale The encoding [unknown] is not recognised by the JRE
	java.lang.IllegalArgumentException: java.io.UnsupportedEncodingException: The character encoding [unknown] is not supported
		at org.apache.coyote.Response.setCharacterEncoding(Response.java:485)
		at org.apache.catalina.connector.Response.setLocale(Response.java:880)
		at org.apache.catalina.connector.TestResponse.testSetLocale06(TestResponse.java:906)
		at java.base/jdk.internal.reflect.NativeMethodAccessorImpl.invoke0(Native Method)
		at java.base/jdk.internal.reflect.NativeMethodAccessorImpl.invoke(NativeMethodAccessorImpl.java:62)
		at java.base/jdk.internal.reflect.DelegatingMethodAccessorImpl.invoke(DelegatingMethodAccessorImpl.java:43)
		at java.base/java.lang.reflect.Method.invoke(Method.java:566)
		at org.junit.runners.model.FrameworkMethod$1.runReflectiveCall(FrameworkMethod.java:59)
		at org.junit.internal.runners.model.ReflectiveCallable.run(ReflectiveCallable.java:12)
		at org.junit.runners.model.FrameworkMethod.invokeExplosively(FrameworkMethod.java:61)
		at org.junit.internal.runners.statements.InvokeMethod.evaluate(InvokeMethod.java:17)
		at org.junit.internal.runners.statements.RunBefores.evaluate(RunBefores.java:26)
		at org.junit.internal.runners.statements.RunAfters.evaluate(RunAfters.java:27)
		at org.junit.rules.TestWatcher$1.evaluate(TestWatcher.java:61)
		at org.junit.runners.ParentRunner$3.evaluate(ParentRunner.java:306)
		at org.junit.runners.BlockJUnit4ClassRunner$1.evaluate(BlockJUnit4ClassRunner.java:100)
		at org.junit.runners.ParentRunner.runLeaf(ParentRunner.java:366)
		at org.junit.runners.BlockJUnit4ClassRunner.runChild(BlockJUnit4ClassRunner.java:103)
		at org.junit.runners.BlockJUnit4ClassRunner.runChild(BlockJUnit4ClassRunner.java:63)
		at org.junit.runners.ParentRunner$4.run(ParentRunner.java:331)
		at org.junit.runners.ParentRunner$1.schedule(ParentRunner.java:79)
		at org.junit.runners.ParentRunner.runChildren(ParentRunner.java:329)
		at org.junit.runners.ParentRunner.access$100(ParentRunner.java:66)
		at org.junit.runners.ParentRunner$2.evaluate(ParentRunner.java:293)
		at org.junit.internal.runners.statements.RunBefores.evaluate(RunBefores.java:26)
		at org.junit.internal.runners.statements.RunAfters.evaluate(RunAfters.java:27)
		at org.junit.runners.ParentRunner$3.evaluate(ParentRunner.java:306)
		at org.junit.runners.ParentRunner.run(ParentRunner.java:413)
		at junit.framework.JUnit4TestAdapter.run(JUnit4TestAdapter.java:50)
		at org.apache.tools.ant.taskdefs.optional.junit.JUnitTestRunner.run(JUnitTestRunner.java:535)
		at org.apache.tools.ant.taskdefs.optional.junit.JUnitTestRunner.launch(JUnitTestRunner.java:1197)
		at org.apache.tools.ant.taskdefs.optional.junit.JUnitTestRunner.main(JUnitTestRunner.java:1042)
	Caused by: java.io.UnsupportedEncodingException: The character encoding [unknown] is not supported
		at org.apache.tomcat.util.buf.B2CConverter.getCharsetLower(B2CConverter.java:87)
		at org.apache.tomcat.util.buf.B2CConverter.getCharset(B2CConverter.java:62)
		at org.apache.coyote.Response.setCharacterEncoding(Response.java:483)
		... 31 more
17-Oct-2021 10:02:34.479 INFO [main] org.apache.coyote.AbstractProtocol.destroy Destroying ProtocolHandler ["http-apr-127.0.0.1-auto-9"]
17-Oct-2021 10:02:34.481 INFO [main] org.apache.catalina.startup.LoggingBaseTest.setUp Starting test case [testSetLocale07]
17-Oct-2021 10:02:34.492 INFO [main] org.apache.coyote.AbstractProtocol.destroy Destroying ProtocolHandler ["http-apr-127.0.0.1-auto-10"]
17-Oct-2021 10:02:34.493 INFO [main] org.apache.catalina.startup.LoggingBaseTest.setUp Starting test case [testSetLocale08]
17-Oct-2021 10:02:34.497 INFO [main] org.apache.coyote.AbstractProtocol.destroy Destroying ProtocolHandler ["http-apr-127.0.0.1-auto-11"]
17-Oct-2021 10:02:34.498 INFO [main] org.apache.catalina.startup.LoggingBaseTest.setUp Starting test case [testBug49598]
17-Oct-2021 10:02:34.520 INFO [main] org.apache.catalina.core.AprLifecycleListener.lifecycleEvent Loaded Apache Tomcat Native library [1.2.32-dev] using APR version [1.7.1-dev].
17-Oct-2021 10:02:34.521 INFO [main] org.apache.catalina.core.AprLifecycleListener.lifecycleEvent APR capabilities: IPv6 [true], sendfile [true], accept filters [false], random [true], UDS [{4}].
17-Oct-2021 10:02:34.521 INFO [main] org.apache.catalina.core.AprLifecycleListener.lifecycleEvent APR/OpenSSL configuration: useAprConnector [false], useOpenSSL [true]
17-Oct-2021 10:02:34.521 INFO [main] org.apache.catalina.core.AprLifecycleListener.lifecycleEvent Loaded Apache Tomcat Native library [1.2.32-dev] using APR version [1.7.1-dev].
17-Oct-2021 10:02:34.521 INFO [main] org.apache.catalina.core.AprLifecycleListener.lifecycleEvent APR capabilities: IPv6 [true], sendfile [true], accept filters [false], random [true], UDS [{4}].
17-Oct-2021 10:02:34.521 INFO [main] org.apache.catalina.core.AprLifecycleListener.lifecycleEvent APR/OpenSSL configuration: useAprConnector [false], useOpenSSL [true]
17-Oct-2021 10:02:34.521 INFO [main] org.apache.catalina.core.AprLifecycleListener.lifecycleEvent Loaded Apache Tomcat Native library [1.2.32-dev] using APR version [1.7.1-dev].
17-Oct-2021 10:02:34.521 INFO [main] org.apache.catalina.core.AprLifecycleListener.lifecycleEvent APR capabilities: IPv6 [true], sendfile [true], accept filters [false], random [true], UDS [{4}].
17-Oct-2021 10:02:34.521 INFO [main] org.apache.catalina.core.AprLifecycleListener.lifecycleEvent APR/OpenSSL configuration: useAprConnector [false], useOpenSSL [true]
17-Oct-2021 10:02:34.522 INFO [main] org.apache.catalina.core.AprLifecycleListener.lifecycleEvent Loaded Apache Tomcat Native library [1.2.32-dev] using APR version [1.7.1-dev].
17-Oct-2021 10:02:34.522 INFO [main] org.apache.catalina.core.AprLifecycleListener.lifecycleEvent APR capabilities: IPv6 [true], sendfile [true], accept filters [false], random [true], UDS [{4}].
17-Oct-2021 10:02:34.522 INFO [main] org.apache.catalina.core.AprLifecycleListener.lifecycleEvent APR/OpenSSL configuration: useAprConnector [false], useOpenSSL [true]
17-Oct-2021 10:02:34.522 INFO [main] org.apache.catalina.core.AprLifecycleListener.lifecycleEvent Loaded Apache Tomcat Native library [1.2.32-dev] using APR version [1.7.1-dev].
17-Oct-2021 10:02:34.522 INFO [main] org.apache.catalina.core.AprLifecycleListener.lifecycleEvent APR capabilities: IPv6 [true], sendfile [true], accept filters [false], random [true], UDS [{4}].
17-Oct-2021 10:02:34.522 INFO [main] org.apache.catalina.core.AprLifecycleListener.lifecycleEvent APR/OpenSSL configuration: useAprConnector [false], useOpenSSL [true]
17-Oct-2021 10:02:34.522 INFO [main] org.apache.catalina.core.AprLifecycleListener.lifecycleEvent Loaded Apache Tomcat Native library [1.2.32-dev] using APR version [1.7.1-dev].
17-Oct-2021 10:02:34.522 INFO [main] org.apache.catalina.core.AprLifecycleListener.lifecycleEvent APR capabilities: IPv6 [true], sendfile [true], accept filters [false], random [true], UDS [{4}].
17-Oct-2021 10:02:34.523 INFO [main] org.apache.catalina.core.AprLifecycleListener.lifecycleEvent APR/OpenSSL configuration: useAprConnector [false], useOpenSSL [true]
17-Oct-2021 10:02:34.523 INFO [main] org.apache.catalina.core.AprLifecycleListener.lifecycleEvent Loaded Apache Tomcat Native library [1.2.32-dev] using APR version [1.7.1-dev].
17-Oct-2021 10:02:34.523 INFO [main] org.apache.catalina.core.AprLifecycleListener.lifecycleEvent APR capabilities: IPv6 [true], sendfile [true], accept filters [false], random [true], UDS [{4}].
17-Oct-2021 10:02:34.523 INFO [main] org.apache.catalina.core.AprLifecycleListener.lifecycleEvent APR/OpenSSL configuration: useAprConnector [false], useOpenSSL [true]
17-Oct-2021 10:02:34.523 INFO [main] org.apache.catalina.core.AprLifecycleListener.lifecycleEvent Loaded Apache Tomcat Native library [1.2.32-dev] using APR version [1.7.1-dev].
17-Oct-2021 10:02:34.523 INFO [main] org.apache.catalina.core.AprLifecycleListener.lifecycleEvent APR capabilities: IPv6 [true], sendfile [true], accept filters [false], random [true], UDS [{4}].
17-Oct-2021 10:02:34.523 INFO [main] org.apache.catalina.core.AprLifecycleListener.lifecycleEvent APR/OpenSSL configuration: useAprConnector [false], useOpenSSL [true]
17-Oct-2021 10:02:34.523 INFO [main] org.apache.catalina.core.AprLifecycleListener.lifecycleEvent Loaded Apache Tomcat Native library [1.2.32-dev] using APR version [1.7.1-dev].
17-Oct-2021 10:02:34.524 INFO [main] org.apache.catalina.core.AprLifecycleListener.lifecycleEvent APR capabilities: IPv6 [true], sendfile [true], accept filters [false], random [true], UDS [{4}].
17-Oct-2021 10:02:34.524 INFO [main] org.apache.catalina.core.AprLifecycleListener.lifecycleEvent APR/OpenSSL configuration: useAprConnector [false], useOpenSSL [true]
17-Oct-2021 10:02:34.524 INFO [main] org.apache.catalina.core.AprLifecycleListener.lifecycleEvent Loaded Apache Tomcat Native library [1.2.32-dev] using APR version [1.7.1-dev].
17-Oct-2021 10:02:34.524 INFO [main] org.apache.catalina.core.AprLifecycleListener.lifecycleEvent APR capabilities: IPv6 [true], sendfile [true], accept filters [false], random [true], UDS [{4}].
17-Oct-2021 10:02:34.524 INFO [main] org.apache.catalina.core.AprLifecycleListener.lifecycleEvent APR/OpenSSL configuration: useAprConnector [false], useOpenSSL [true]
17-Oct-2021 10:02:34.524 INFO [main] org.apache.catalina.core.AprLifecycleListener.lifecycleEvent Loaded Apache Tomcat Native library [1.2.32-dev] using APR version [1.7.1-dev].
17-Oct-2021 10:02:34.524 INFO [main] org.apache.catalina.core.AprLifecycleListener.lifecycleEvent APR capabilities: IPv6 [true], sendfile [true], accept filters [false], random [true], UDS [{4}].
17-Oct-2021 10:02:34.524 INFO [main] org.apache.catalina.core.AprLifecycleListener.lifecycleEvent APR/OpenSSL configuration: useAprConnector [false], useOpenSSL [true]
17-Oct-2021 10:02:34.525 INFO [main] org.apache.catalina.core.AprLifecycleListener.lifecycleEvent Loaded Apache Tomcat Native library [1.2.32-dev] using APR version [1.7.1-dev].
17-Oct-2021 10:02:34.525 INFO [main] org.apache.catalina.core.AprLifecycleListener.lifecycleEvent APR capabilities: IPv6 [true], sendfile [true], accept filters [false], random [true], UDS [{4}].
17-Oct-2021 10:02:34.525 INFO [main] org.apache.catalina.core.AprLifecycleListener.lifecycleEvent APR/OpenSSL configuration: useAprConnector [false], useOpenSSL [true]
17-Oct-2021 10:02:34.527 INFO [main] org.apache.catalina.core.AprLifecycleListener.initializeSSL OpenSSL successfully initialized [OpenSSL 1.1.1m-dev  xx XXX xxxx]
17-Oct-2021 10:02:34.762 INFO [main] org.apache.coyote.AbstractProtocol.init Initializing ProtocolHandler ["http-apr-127.0.0.1-auto-12"]
17-Oct-2021 10:02:34.776 INFO [main] org.apache.catalina.core.StandardService.startInternal Starting service [Tomcat]

Continuation...

17-Oct-2021 10:02:34.776 INFO [main] org.apache.catalina.core.StandardEngine.startInternal Starting Servlet engine: [Apache Tomcat/8.5.72-dev]
17-Oct-2021 10:02:34.864 INFO [main] org.apache.coyote.AbstractProtocol.start Starting ProtocolHandler ["http-apr-127.0.0.1-auto-12-35905"]
17-Oct-2021 10:02:34.930 INFO [main] org.apache.coyote.AbstractProtocol.pause Pausing ProtocolHandler ["http-apr-127.0.0.1-auto-12-35905"]
17-Oct-2021 10:02:34.932 INFO [main] org.apache.catalina.core.StandardService.stopInternal Stopping service [Tomcat]
17-Oct-2021 10:02:34.947 INFO [main] org.apache.coyote.AbstractProtocol.stop Stopping ProtocolHandler ["http-apr-127.0.0.1-auto-12-35905"]
17-Oct-2021 10:02:34.999 INFO [main] org.apache.coyote.AbstractProtocol.destroy Destroying ProtocolHandler ["http-apr-127.0.0.1-auto-12-35905"]
17-Oct-2021 10:02:35.002 INFO [main] org.apache.catalina.startup.LoggingBaseTest.setUp Starting test case [testBug52811]
17-Oct-2021 10:02:35.003 INFO [main] org.apache.catalina.core.AprLifecycleListener.lifecycleEvent Loaded Apache Tomcat Native library [1.2.32-dev] using APR version [1.7.1-dev].
17-Oct-2021 10:02:35.004 INFO [main] org.apache.catalina.core.AprLifecycleListener.lifecycleEvent APR capabilities: IPv6 [true], sendfile [true], accept filters [false], random [true], UDS [{4}].
17-Oct-2021 10:02:35.004 INFO [main] org.apache.catalina.core.AprLifecycleListener.lifecycleEvent APR/OpenSSL configuration: useAprConnector [false], useOpenSSL [true]
17-Oct-2021 10:02:35.004 INFO [main] org.apache.catalina.core.AprLifecycleListener.initializeSSL OpenSSL successfully initialized [OpenSSL 1.1.1m-dev  xx XXX xxxx]
17-Oct-2021 10:02:35.011 INFO [main] org.apache.coyote.AbstractProtocol.init Initializing ProtocolHandler ["http-apr-127.0.0.1-auto-13"]
17-Oct-2021 10:02:35.011 INFO [main] org.apache.catalina.core.StandardService.startInternal Starting service [Tomcat]
17-Oct-2021 10:02:35.011 INFO [main] org.apache.catalina.core.StandardEngine.startInternal Starting Servlet engine: [Apache Tomcat/8.5.72-dev]
17-Oct-2021 10:02:35.023 INFO [main] org.apache.coyote.AbstractProtocol.start Starting ProtocolHandler ["http-apr-127.0.0.1-auto-13-46031"]
17-Oct-2021 10:02:35.028 INFO [main] org.apache.coyote.AbstractProtocol.pause Pausing ProtocolHandler ["http-apr-127.0.0.1-auto-13-46031"]
17-Oct-2021 10:02:35.034 INFO [main] org.apache.catalina.core.StandardService.stopInternal Stopping service [Tomcat]
17-Oct-2021 10:02:35.037 INFO [main] org.apache.coyote.AbstractProtocol.stop Stopping ProtocolHandler ["http-apr-127.0.0.1-auto-13-46031"]
17-Oct-2021 10:02:35.088 INFO [main] org.apache.coyote.AbstractProtocol.destroy Destroying ProtocolHandler ["http-apr-127.0.0.1-auto-13-46031"]
17-Oct-2021 10:02:35.090 INFO [main] org.apache.catalina.startup.LoggingBaseTest.setUp Starting test case [testSetContentType01]
17-Oct-2021 10:02:35.091 INFO [main] org.apache.coyote.AbstractProtocol.destroy Destroying ProtocolHandler ["http-apr-127.0.0.1-auto-14"]
17-Oct-2021 10:02:35.092 INFO [main] org.apache.catalina.startup.LoggingBaseTest.setUp Starting test case [testSetContentType02]
17-Oct-2021 10:02:35.093 INFO [main] org.apache.coyote.AbstractProtocol.destroy Destroying ProtocolHandler ["http-apr-127.0.0.1-auto-15"]
17-Oct-2021 10:02:35.094 INFO [main] org.apache.catalina.startup.LoggingBaseTest.setUp Starting test case [testSetContentType03]
17-Oct-2021 10:02:35.096 INFO [main] org.apache.coyote.AbstractProtocol.destroy Destroying ProtocolHandler ["http-apr-127.0.0.1-auto-16"]
17-Oct-2021 10:02:35.096 INFO [main] org.apache.catalina.startup.LoggingBaseTest.setUp Starting test case [testSetContentType04]
17-Oct-2021 10:02:35.097 INFO [main] org.apache.coyote.AbstractProtocol.destroy Destroying ProtocolHandler ["http-apr-127.0.0.1-auto-17"]
17-Oct-2021 10:02:35.098 INFO [main] org.apache.catalina.startup.LoggingBaseTest.setUp Starting test case [testSetContentType05]
17-Oct-2021 10:02:35.099 WARNING [main] org.apache.catalina.connector.Response.setContentType The encoding [unknown] is not recognised by the JRE
	java.lang.IllegalArgumentException: java.io.UnsupportedEncodingException: The character encoding [unknown] is not supported
		at org.apache.coyote.Response.setCharacterEncoding(Response.java:485)
		at org.apache.catalina.connector.Response.setContentType(Response.java:786)
		at org.apache.catalina.connector.TestResponse.testSetContentType05(TestResponse.java:816)
		at java.base/jdk.internal.reflect.NativeMethodAccessorImpl.invoke0(Native Method)
		at java.base/jdk.internal.reflect.NativeMethodAccessorImpl.invoke(NativeMethodAccessorImpl.java:62)
		at java.base/jdk.internal.reflect.DelegatingMethodAccessorImpl.invoke(DelegatingMethodAccessorImpl.java:43)
		at java.base/java.lang.reflect.Method.invoke(Method.java:566)
		at org.junit.runners.model.FrameworkMethod$1.runReflectiveCall(FrameworkMethod.java:59)
		at org.junit.internal.runners.model.ReflectiveCallable.run(ReflectiveCallable.java:12)
		at org.junit.runners.model.FrameworkMethod.invokeExplosively(FrameworkMethod.java:61)
		at org.junit.internal.runners.statements.InvokeMethod.evaluate(InvokeMethod.java:17)
		at org.junit.internal.runners.statements.ExpectException.evaluate(ExpectException.java:19)
		at org.junit.internal.runners.statements.RunBefores.evaluate(RunBefores.java:26)
		at org.junit.internal.runners.statements.RunAfters.evaluate(RunAfters.java:27)
		at org.junit.rules.TestWatcher$1.evaluate(TestWatcher.java:61)
		at org.junit.runners.ParentRunner$3.evaluate(ParentRunner.java:306)
		at org.junit.runners.BlockJUnit4ClassRunner$1.evaluate(BlockJUnit4ClassRunner.java:100)
		at org.junit.runners.ParentRunner.runLeaf(ParentRunner.java:366)
		at org.junit.runners.BlockJUnit4ClassRunner.runChild(BlockJUnit4ClassRunner.java:103)
		at org.junit.runners.BlockJUnit4ClassRunner.runChild(BlockJUnit4ClassRunner.java:63)
		at org.junit.runners.ParentRunner$4.run(ParentRunner.java:331)
		at org.junit.runners.ParentRunner$1.schedule(ParentRunner.java:79)
		at org.junit.runners.ParentRunner.runChildren(ParentRunner.java:329)
		at org.junit.runners.ParentRunner.access$100(ParentRunner.java:66)
		at org.junit.runners.ParentRunner$2.evaluate(ParentRunner.java:293)
		at org.junit.internal.runners.statements.RunBefores.evaluate(RunBefores.java:26)
		at org.junit.internal.runners.statements.RunAfters.evaluate(RunAfters.java:27)
		at org.junit.runners.ParentRunner$3.evaluate(ParentRunner.java:306)
		at org.junit.runners.ParentRunner.run(ParentRunner.java:413)
		at junit.framework.JUnit4TestAdapter.run(JUnit4TestAdapter.java:50)
		at org.apache.tools.ant.taskdefs.optional.junit.JUnitTestRunner.run(JUnitTestRunner.java:535)
		at org.apache.tools.ant.taskdefs.optional.junit.JUnitTestRunner.launch(JUnitTestRunner.java:1197)
		at org.apache.tools.ant.taskdefs.optional.junit.JUnitTestRunner.main(JUnitTestRunner.java:1042)
	Caused by: java.io.UnsupportedEncodingException: The character encoding [unknown] is not supported
		at org.apache.tomcat.util.buf.B2CConverter.getCharsetLower(B2CConverter.java:87)
		at org.apache.tomcat.util.buf.B2CConverter.getCharset(B2CConverter.java:62)
		at org.apache.coyote.Response.setCharacterEncoding(Response.java:483)
		... 32 more
17-Oct-2021 10:02:35.100 WARNING [main] org.apache.catalina.connector.Response.setCharacterEncoding The encoding [unknown] is not recognised by the JRE
	java.lang.IllegalArgumentException: java.io.UnsupportedEncodingException: The character encoding [unknown] is not supported
		at org.apache.coyote.Response.setCharacterEncoding(Response.java:485)
		at org.apache.catalina.connector.Response.setCharacterEncoding(Response.java:823)
		at org.apache.catalina.connector.Response.getWriter(Response.java:603)
		at org.apache.catalina.connector.TestResponse.testSetContentType05(TestResponse.java:818)
		at java.base/jdk.internal.reflect.NativeMethodAccessorImpl.invoke0(Native Method)
		at java.base/jdk.internal.reflect.NativeMethodAccessorImpl.invoke(NativeMethodAccessorImpl.java:62)
		at java.base/jdk.internal.reflect.DelegatingMethodAccessorImpl.invoke(DelegatingMethodAccessorImpl.java:43)
		at java.base/java.lang.reflect.Method.invoke(Method.java:566)
		at org.junit.runners.model.FrameworkMethod$1.runReflectiveCall(FrameworkMethod.java:59)
		at org.junit.internal.runners.model.ReflectiveCallable.run(ReflectiveCallable.java:12)
		at org.junit.runners.model.FrameworkMethod.invokeExplosively(FrameworkMethod.java:61)
		at org.junit.internal.runners.statements.InvokeMethod.evaluate(InvokeMethod.java:17)
		at org.junit.internal.runners.statements.ExpectException.evaluate(ExpectException.java:19)
		at org.junit.internal.runners.statements.RunBefores.evaluate(RunBefores.java:26)
		at org.junit.internal.runners.statements.RunAfters.evaluate(RunAfters.java:27)
		at org.junit.rules.TestWatcher$1.evaluate(TestWatcher.java:61)
		at org.junit.runners.ParentRunner$3.evaluate(ParentRunner.java:306)
		at org.junit.runners.BlockJUnit4ClassRunner$1.evaluate(BlockJUnit4ClassRunner.java:100)
		at org.junit.runners.ParentRunner.runLeaf(ParentRunner.java:366)
		at org.junit.runners.BlockJUnit4ClassRunner.runChild(BlockJUnit4ClassRunner.java:103)
		at org.junit.runners.BlockJUnit4ClassRunner.runChild(BlockJUnit4ClassRunner.java:63)
		at org.junit.runners.ParentRunner$4.run(ParentRunner.java:331)
		at org.junit.runners.ParentRunner$1.schedule(ParentRunner.java:79)
		at org.junit.runners.ParentRunner.runChildren(ParentRunner.java:329)
		at org.junit.runners.ParentRunner.access$100(ParentRunner.java:66)
		at org.junit.runners.ParentRunner$2.evaluate(ParentRunner.java:293)
		at org.junit.internal.runners.statements.RunBefores.evaluate(RunBefores.java:26)
		at org.junit.internal.runners.statements.RunAfters.evaluate(RunAfters.java:27)
		at org.junit.runners.ParentRunner$3.evaluate(ParentRunner.java:306)
		at org.junit.runners.ParentRunner.run(ParentRunner.java:413)
		at junit.framework.JUnit4TestAdapter.run(JUnit4TestAdapter.java:50)
		at org.apache.tools.ant.taskdefs.optional.junit.JUnitTestRunner.run(JUnitTestRunner.java:535)
		at org.apache.tools.ant.taskdefs.optional.junit.JUnitTestRunner.launch(JUnitTestRunner.java:1197)
		at org.apache.tools.ant.taskdefs.optional.junit.JUnitTestRunner.main(JUnitTestRunner.java:1042)
	Caused by: java.io.UnsupportedEncodingException: The character encoding [unknown] is not supported
		at org.apache.tomcat.util.buf.B2CConverter.getCharsetLower(B2CConverter.java:87)
		at org.apache.tomcat.util.buf.B2CConverter.getCharset(B2CConverter.java:62)
		at org.apache.coyote.Response.setCharacterEncoding(Response.java:483)
		... 33 more
17-Oct-2021 10:02:35.100 INFO [main] org.apache.coyote.AbstractProtocol.destroy Destroying ProtocolHandler ["http-apr-127.0.0.1-auto-18"]
17-Oct-2021 10:02:35.101 INFO [main] org.apache.catalina.startup.LoggingBaseTest.setUp Starting test case [testSetContentType06]
17-Oct-2021 10:02:35.102 WARNING [main] org.apache.catalina.connector.Response.setContentType The encoding [unknown] is not recognised by the JRE
	java.lang.IllegalArgumentException: java.io.UnsupportedEncodingException: The character encoding [unknown] is not supported
		at org.apache.coyote.Response.setCharacterEncoding(Response.java:485)
		at org.apache.catalina.connector.Response.setContentType(Response.java:786)
		at org.apache.catalina.connector.TestResponse.testSetContentType06(TestResponse.java:828)
		at java.base/jdk.internal.reflect.NativeMethodAccessorImpl.invoke0(Native Method)
		at java.base/jdk.internal.reflect.NativeMethodAccessorImpl.invoke(NativeMethodAccessorImpl.java:62)
		at java.base/jdk.internal.reflect.DelegatingMethodAccessorImpl.invoke(DelegatingMethodAccessorImpl.java:43)
		at java.base/java.lang.reflect.Method.invoke(Method.java:566)
		at org.junit.runners.model.FrameworkMethod$1.runReflectiveCall(FrameworkMethod.java:59)
		at org.junit.internal.runners.model.ReflectiveCallable.run(ReflectiveCallable.java:12)
		at org.junit.runners.model.FrameworkMethod.invokeExplosively(FrameworkMethod.java:61)
		at org.junit.internal.runners.statements.InvokeMethod.evaluate(InvokeMethod.java:17)
		at org.junit.internal.runners.statements.RunBefores.evaluate(RunBefores.java:26)
		at org.junit.internal.runners.statements.RunAfters.evaluate(RunAfters.java:27)
		at org.junit.rules.TestWatcher$1.evaluate(TestWatcher.java:61)
		at org.junit.runners.ParentRunner$3.evaluate(ParentRunner.java:306)
		at org.junit.runners.BlockJUnit4ClassRunner$1.evaluate(BlockJUnit4ClassRunner.java:100)
		at org.junit.runners.ParentRunner.runLeaf(ParentRunner.java:366)
		at org.junit.runners.BlockJUnit4ClassRunner.runChild(BlockJUnit4ClassRunner.java:103)
		at org.junit.runners.BlockJUnit4ClassRunner.runChild(BlockJUnit4ClassRunner.java:63)
		at org.junit.runners.ParentRunner$4.run(ParentRunner.java:331)
		at org.junit.runners.ParentRunner$1.schedule(ParentRunner.java:79)
		at org.junit.runners.ParentRunner.runChildren(ParentRunner.java:329)
		at org.junit.runners.ParentRunner.access$100(ParentRunner.java:66)
		at org.junit.runners.ParentRunner$2.evaluate(ParentRunner.java:293)
		at org.junit.internal.runners.statements.RunBefores.evaluate(RunBefores.java:26)
		at org.junit.internal.runners.statements.RunAfters.evaluate(RunAfters.java:27)
		at org.junit.runners.ParentRunner$3.evaluate(ParentRunner.java:306)
		at org.junit.runners.ParentRunner.run(ParentRunner.java:413)
		at junit.framework.JUnit4TestAdapter.run(JUnit4TestAdapter.java:50)
		at org.apache.tools.ant.taskdefs.optional.junit.JUnitTestRunner.run(JUnitTestRunner.java:535)
		at org.apache.tools.ant.taskdefs.optional.junit.JUnitTestRunner.launch(JUnitTestRunner.java:1197)
		at org.apache.tools.ant.taskdefs.optional.junit.JUnitTestRunner.main(JUnitTestRunner.java:1042)
	Caused by: java.io.UnsupportedEncodingException: The character encoding [unknown] is not supported
		at org.apache.tomcat.util.buf.B2CConverter.getCharsetLower(B2CConverter.java:87)
		at org.apache.tomcat.util.buf.B2CConverter.getCharset(B2CConverter.java:62)
		at org.apache.coyote.Response.setCharacterEncoding(Response.java:483)
		... 31 more
17-Oct-2021 10:02:35.103 INFO [main] org.apache.coyote.AbstractProtocol.destroy Destroying ProtocolHandler ["http-apr-127.0.0.1-auto-19"]
17-Oct-2021 10:02:35.103 INFO [main] org.apache.catalina.startup.LoggingBaseTest.setUp Starting test case [testBug53062a]
17-Oct-2021 10:02:35.105 INFO [main] org.apache.coyote.AbstractProtocol.destroy Destroying ProtocolHandler ["http-apr-127.0.0.1-auto-20"]
17-Oct-2021 10:02:35.106 INFO [main] org.apache.catalina.startup.LoggingBaseTest.setUp Starting test case [testBug53062b]
17-Oct-2021 10:02:35.107 INFO [main] org.apache.coyote.AbstractProtocol.destroy Destroying ProtocolHandler ["http-apr-127.0.0.1-auto-21"]
17-Oct-2021 10:02:35.107 INFO [main] org.apache.catalina.startup.LoggingBaseTest.setUp Starting test case [testBug53062c]
17-Oct-2021 10:02:35.108 INFO [main] org.apache.coyote.AbstractProtocol.destroy Destroying ProtocolHandler ["http-apr-127.0.0.1-auto-22"]
17-Oct-2021 10:02:35.108 INFO [main] org.apache.catalina.startup.LoggingBaseTest.setUp Starting test case [testBug53062d]
17-Oct-2021 10:02:35.109 INFO [main] org.apache.coyote.AbstractProtocol.destroy Destroying ProtocolHandler ["http-apr-127.0.0.1-auto-23"]
17-Oct-2021 10:02:35.110 INFO [main] org.apache.catalina.startup.LoggingBaseTest.setUp Starting test case [testBug53062e]
17-Oct-2021 10:02:35.111 INFO [main] org.apache.coyote.AbstractProtocol.destroy Destroying ProtocolHandler ["http-apr-127.0.0.1-auto-24"]
17-Oct-2021 10:02:35.111 INFO [main] org.apache.catalina.startup.LoggingBaseTest.setUp Starting test case [testBug53062f]
17-Oct-2021 10:02:35.112 INFO [main] org.apache.coyote.AbstractProtocol.destroy Destroying ProtocolHandler ["http-apr-127.0.0.1-auto-25"]
17-Oct-2021 10:02:35.113 INFO [main] org.apache.catalina.startup.LoggingBaseTest.setUp Starting test case [testBug53062g]
17-Oct-2021 10:02:35.113 INFO [main] org.apache.coyote.AbstractProtocol.destroy Destroying ProtocolHandler ["http-apr-127.0.0.1-auto-26"]
17-Oct-2021 10:02:35.114 INFO [main] org.apache.catalina.startup.LoggingBaseTest.setUp Starting test case [testBug53062h]
17-Oct-2021 10:02:35.115 INFO [main] org.apache.coyote.AbstractProtocol.destroy Destroying ProtocolHandler ["http-apr-127.0.0.1-auto-27"]
17-Oct-2021 10:02:35.115 INFO [main] org.apache.catalina.startup.LoggingBaseTest.setUp Starting test case [testBug53062i]
17-Oct-2021 10:02:35.116 INFO [main] org.apache.coyote.AbstractProtocol.destroy Destroying ProtocolHandler ["http-apr-127.0.0.1-auto-28"]
17-Oct-2021 10:02:35.116 INFO [main] org.apache.catalina.startup.LoggingBaseTest.setUp Starting test case [testBug53062j]
17-Oct-2021 10:02:35.117 INFO [main] org.apache.coyote.AbstractProtocol.destroy Destroying ProtocolHandler ["http-apr-127.0.0.1-auto-29"]
17-Oct-2021 10:02:35.117 INFO [main] org.apache.catalina.startup.LoggingBaseTest.setUp Starting test case [testBug53062k]
17-Oct-2021 10:02:35.118 INFO [main] org.apache.coyote.AbstractProtocol.destroy Destroying ProtocolHandler ["http-apr-127.0.0.1-auto-30"]
17-Oct-2021 10:02:35.118 INFO [main] org.apache.catalina.startup.LoggingBaseTest.setUp Starting test case [testBug53062l]
17-Oct-2021 10:02:35.119 INFO [main] org.apache.coyote.AbstractProtocol.destroy Destroying ProtocolHandler ["http-apr-127.0.0.1-auto-31"]
17-Oct-2021 10:02:35.119 INFO [main] org.apache.catalina.startup.LoggingBaseTest.setUp Starting test case [testBug53062m]
17-Oct-2021 10:02:35.120 INFO [main] org.apache.coyote.AbstractProtocol.destroy Destroying ProtocolHandler ["http-apr-127.0.0.1-auto-32"]
17-Oct-2021 10:02:35.120 INFO [main] org.apache.catalina.startup.LoggingBaseTest.setUp Starting test case [testBug53062n]
17-Oct-2021 10:02:35.121 INFO [main] org.apache.coyote.AbstractProtocol.destroy Destroying ProtocolHandler ["http-apr-127.0.0.1-auto-33"]
17-Oct-2021 10:02:35.122 INFO [main] org.apache.catalina.startup.LoggingBaseTest.setUp Starting test case [testBug53062o]
17-Oct-2021 10:02:35.122 INFO [main] org.apache.coyote.AbstractProtocol.destroy Destroying ProtocolHandler ["http-apr-127.0.0.1-auto-34"]
17-Oct-2021 10:02:35.123 INFO [main] org.apache.catalina.startup.LoggingBaseTest.setUp Starting test case [testBug53062p]
17-Oct-2021 10:02:35.123 INFO [main] org.apache.coyote.AbstractProtocol.destroy Destroying ProtocolHandler ["http-apr-127.0.0.1-auto-35"]
17-Oct-2021 10:02:35.124 INFO [main] org.apache.catalina.startup.LoggingBaseTest.setUp Starting test case [testBug53469a]
17-Oct-2021 10:02:35.124 INFO [main] org.apache.coyote.AbstractProtocol.destroy Destroying ProtocolHandler ["http-apr-127.0.0.1-auto-36"]
17-Oct-2021 10:02:35.125 INFO [main] org.apache.catalina.startup.LoggingBaseTest.setUp Starting test case [testBug53469b]
17-Oct-2021 10:02:35.126 INFO [main] org.apache.coyote.AbstractProtocol.destroy Destroying ProtocolHandler ["http-apr-127.0.0.1-auto-37"]
17-Oct-2021 10:02:35.126 INFO [main] org.apache.catalina.startup.LoggingBaseTest.setUp Starting test case [testCharset]
17-Oct-2021 10:02:35.127 INFO [main] org.apache.catalina.core.AprLifecycleListener.lifecycleEvent Loaded Apache Tomcat Native library [1.2.32-dev] using APR version [1.7.1-dev].
17-Oct-2021 10:02:35.127 INFO [main] org.apache.catalina.core.AprLifecycleListener.lifecycleEvent APR capabilities: IPv6 [true], sendfile [true], accept filters [false], random [true], UDS [{4}].
17-Oct-2021 10:02:35.127 INFO [main] org.apache.catalina.core.AprLifecycleListener.lifecycleEvent APR/OpenSSL configuration: useAprConnector [false], useOpenSSL [true]
17-Oct-2021 10:02:35.127 INFO [main] org.apache.catalina.core.AprLifecycleListener.lifecycleEvent Loaded Apache Tomcat Native library [1.2.32-dev] using APR version [1.7.1-dev].
17-Oct-2021 10:02:35.127 INFO [main] org.apache.catalina.core.AprLifecycleListener.lifecycleEvent APR capabilities: IPv6 [true], sendfile [true], accept filters [false], random [true], UDS [{4}].

Continuation...

17-Oct-2021 10:02:35.127 INFO [main] org.apache.catalina.core.AprLifecycleListener.lifecycleEvent APR/OpenSSL configuration: useAprConnector [false], useOpenSSL [true]
17-Oct-2021 10:02:35.127 INFO [main] org.apache.catalina.core.AprLifecycleListener.lifecycleEvent Loaded Apache Tomcat Native library [1.2.32-dev] using APR version [1.7.1-dev].
17-Oct-2021 10:02:35.127 INFO [main] org.apache.catalina.core.AprLifecycleListener.lifecycleEvent APR capabilities: IPv6 [true], sendfile [true], accept filters [false], random [true], UDS [{4}].
17-Oct-2021 10:02:35.127 INFO [main] org.apache.catalina.core.AprLifecycleListener.lifecycleEvent APR/OpenSSL configuration: useAprConnector [false], useOpenSSL [true]
17-Oct-2021 10:02:35.127 INFO [main] org.apache.catalina.core.AprLifecycleListener.lifecycleEvent Loaded Apache Tomcat Native library [1.2.32-dev] using APR version [1.7.1-dev].
17-Oct-2021 10:02:35.127 INFO [main] org.apache.catalina.core.AprLifecycleListener.lifecycleEvent APR capabilities: IPv6 [true], sendfile [true], accept filters [false], random [true], UDS [{4}].
17-Oct-2021 10:02:35.127 INFO [main] org.apache.catalina.core.AprLifecycleListener.lifecycleEvent APR/OpenSSL configuration: useAprConnector [false], useOpenSSL [true]
17-Oct-2021 10:02:35.128 INFO [main] org.apache.catalina.core.AprLifecycleListener.lifecycleEvent Loaded Apache Tomcat Native library [1.2.32-dev] using APR version [1.7.1-dev].
17-Oct-2021 10:02:35.128 INFO [main] org.apache.catalina.core.AprLifecycleListener.lifecycleEvent APR capabilities: IPv6 [true], sendfile [true], accept filters [false], random [true], UDS [{4}].
17-Oct-2021 10:02:35.128 INFO [main] org.apache.catalina.core.AprLifecycleListener.lifecycleEvent APR/OpenSSL configuration: useAprConnector [false], useOpenSSL [true]
17-Oct-2021 10:02:35.128 INFO [main] org.apache.catalina.core.AprLifecycleListener.lifecycleEvent Loaded Apache Tomcat Native library [1.2.32-dev] using APR version [1.7.1-dev].
17-Oct-2021 10:02:35.128 INFO [main] org.apache.catalina.core.AprLifecycleListener.lifecycleEvent APR capabilities: IPv6 [true], sendfile [true], accept filters [false], random [true], UDS [{4}].
17-Oct-2021 10:02:35.128 INFO [main] org.apache.catalina.core.AprLifecycleListener.lifecycleEvent APR/OpenSSL configuration: useAprConnector [false], useOpenSSL [true]
17-Oct-2021 10:02:35.128 INFO [main] org.apache.catalina.core.AprLifecycleListener.lifecycleEvent Loaded Apache Tomcat Native library [1.2.32-dev] using APR version [1.7.1-dev].
17-Oct-2021 10:02:35.128 INFO [main] org.apache.catalina.core.AprLifecycleListener.lifecycleEvent APR capabilities: IPv6 [true], sendfile [true], accept filters [false], random [true], UDS [{4}].
17-Oct-2021 10:02:35.128 INFO [main] org.apache.catalina.core.AprLifecycleListener.lifecycleEvent APR/OpenSSL configuration: useAprConnector [false], useOpenSSL [true]
17-Oct-2021 10:02:35.128 INFO [main] org.apache.catalina.core.AprLifecycleListener.lifecycleEvent Loaded Apache Tomcat Native library [1.2.32-dev] using APR version [1.7.1-dev].
17-Oct-2021 10:02:35.128 INFO [main] org.apache.catalina.core.AprLifecycleListener.lifecycleEvent APR capabilities: IPv6 [true], sendfile [true], accept filters [false], random [true], UDS [{4}].
17-Oct-2021 10:02:35.128 INFO [main] org.apache.catalina.core.AprLifecycleListener.lifecycleEvent APR/OpenSSL configuration: useAprConnector [false], useOpenSSL [true]
17-Oct-2021 10:02:35.128 INFO [main] org.apache.catalina.core.AprLifecycleListener.lifecycleEvent Loaded Apache Tomcat Native library [1.2.32-dev] using APR version [1.7.1-dev].
17-Oct-2021 10:02:35.128 INFO [main] org.apache.catalina.core.AprLifecycleListener.lifecycleEvent APR capabilities: IPv6 [true], sendfile [true], accept filters [false], random [true], UDS [{4}].
17-Oct-2021 10:02:35.128 INFO [main] org.apache.catalina.core.AprLifecycleListener.lifecycleEvent APR/OpenSSL configuration: useAprConnector [false], useOpenSSL [true]
17-Oct-2021 10:02:35.128 INFO [main] org.apache.catalina.core.AprLifecycleListener.lifecycleEvent Loaded Apache Tomcat Native library [1.2.32-dev] using APR version [1.7.1-dev].
17-Oct-2021 10:02:35.128 INFO [main] org.apache.catalina.core.AprLifecycleListener.lifecycleEvent APR capabilities: IPv6 [true], sendfile [true], accept filters [false], random [true], UDS [{4}].
17-Oct-2021 10:02:35.128 INFO [main] org.apache.catalina.core.AprLifecycleListener.lifecycleEvent APR/OpenSSL configuration: useAprConnector [false], useOpenSSL [true]
17-Oct-2021 10:02:35.128 INFO [main] org.apache.catalina.core.AprLifecycleListener.lifecycleEvent Loaded Apache Tomcat Native library [1.2.32-dev] using APR version [1.7.1-dev].
17-Oct-2021 10:02:35.129 INFO [main] org.apache.catalina.core.AprLifecycleListener.lifecycleEvent APR capabilities: IPv6 [true], sendfile [true], accept filters [false], random [true], UDS [{4}].
17-Oct-2021 10:02:35.129 INFO [main] org.apache.catalina.core.AprLifecycleListener.lifecycleEvent APR/OpenSSL configuration: useAprConnector [false], useOpenSSL [true]
17-Oct-2021 10:02:35.129 INFO [main] org.apache.catalina.core.AprLifecycleListener.lifecycleEvent Loaded Apache Tomcat Native library [1.2.32-dev] using APR version [1.7.1-dev].
17-Oct-2021 10:02:35.129 INFO [main] org.apache.catalina.core.AprLifecycleListener.lifecycleEvent APR capabilities: IPv6 [true], sendfile [true], accept filters [false], random [true], UDS [{4}].
17-Oct-2021 10:02:35.129 INFO [main] org.apache.catalina.core.AprLifecycleListener.lifecycleEvent APR/OpenSSL configuration: useAprConnector [false], useOpenSSL [true]
17-Oct-2021 10:02:35.129 INFO [main] org.apache.catalina.core.AprLifecycleListener.lifecycleEvent Loaded Apache Tomcat Native library [1.2.32-dev] using APR version [1.7.1-dev].
17-Oct-2021 10:02:35.129 INFO [main] org.apache.catalina.core.AprLifecycleListener.lifecycleEvent APR capabilities: IPv6 [true], sendfile [true], accept filters [false], random [true], UDS [{4}].
17-Oct-2021 10:02:35.129 INFO [main] org.apache.catalina.core.AprLifecycleListener.lifecycleEvent APR/OpenSSL configuration: useAprConnector [false], useOpenSSL [true]
17-Oct-2021 10:02:35.129 INFO [main] org.apache.catalina.core.AprLifecycleListener.lifecycleEvent Loaded Apache Tomcat Native library [1.2.32-dev] using APR version [1.7.1-dev].
17-Oct-2021 10:02:35.129 INFO [main] org.apache.catalina.core.AprLifecycleListener.lifecycleEvent APR capabilities: IPv6 [true], sendfile [true], accept filters [false], random [true], UDS [{4}].
17-Oct-2021 10:02:35.129 INFO [main] org.apache.catalina.core.AprLifecycleListener.lifecycleEvent APR/OpenSSL configuration: useAprConnector [false], useOpenSSL [true]
17-Oct-2021 10:02:35.129 INFO [main] org.apache.catalina.core.AprLifecycleListener.lifecycleEvent Loaded Apache Tomcat Native library [1.2.32-dev] using APR version [1.7.1-dev].
17-Oct-2021 10:02:35.129 INFO [main] org.apache.catalina.core.AprLifecycleListener.lifecycleEvent APR capabilities: IPv6 [true], sendfile [true], accept filters [false], random [true], UDS [{4}].
17-Oct-2021 10:02:35.129 INFO [main] org.apache.catalina.core.AprLifecycleListener.lifecycleEvent APR/OpenSSL configuration: useAprConnector [false], useOpenSSL [true]
17-Oct-2021 10:02:35.129 INFO [main] org.apache.catalina.core.AprLifecycleListener.lifecycleEvent Loaded Apache Tomcat Native library [1.2.32-dev] using APR version [1.7.1-dev].
17-Oct-2021 10:02:35.129 INFO [main] org.apache.catalina.core.AprLifecycleListener.lifecycleEvent APR capabilities: IPv6 [true], sendfile [true], accept filters [false], random [true], UDS [{4}].
17-Oct-2021 10:02:35.129 INFO [main] org.apache.catalina.core.AprLifecycleListener.lifecycleEvent APR/OpenSSL configuration: useAprConnector [false], useOpenSSL [true]
17-Oct-2021 10:02:35.130 INFO [main] org.apache.catalina.core.AprLifecycleListener.lifecycleEvent Loaded Apache Tomcat Native library [1.2.32-dev] using APR version [1.7.1-dev].
17-Oct-2021 10:02:35.130 INFO [main] org.apache.catalina.core.AprLifecycleListener.lifecycleEvent APR capabilities: IPv6 [true], sendfile [true], accept filters [false], random [true], UDS [{4}].
17-Oct-2021 10:02:35.130 INFO [main] org.apache.catalina.core.AprLifecycleListener.lifecycleEvent APR/OpenSSL configuration: useAprConnector [false], useOpenSSL [true]
17-Oct-2021 10:02:35.130 INFO [main] org.apache.catalina.core.AprLifecycleListener.lifecycleEvent Loaded Apache Tomcat Native library [1.2.32-dev] using APR version [1.7.1-dev].
17-Oct-2021 10:02:35.130 INFO [main] org.apache.catalina.core.AprLifecycleListener.lifecycleEvent APR capabilities: IPv6 [true], sendfile [true], accept filters [false], random [true], UDS [{4}].
17-Oct-2021 10:02:35.130 INFO [main] org.apache.catalina.core.AprLifecycleListener.lifecycleEvent APR/OpenSSL configuration: useAprConnector [false], useOpenSSL [true]
17-Oct-2021 10:02:35.130 INFO [main] org.apache.catalina.core.AprLifecycleListener.lifecycleEvent Loaded Apache Tomcat Native library [1.2.32-dev] using APR version [1.7.1-dev].
17-Oct-2021 10:02:35.130 INFO [main] org.apache.catalina.core.AprLifecycleListener.lifecycleEvent APR capabilities: IPv6 [true], sendfile [true], accept filters [false], random [true], UDS [{4}].
17-Oct-2021 10:02:35.130 INFO [main] org.apache.catalina.core.AprLifecycleListener.lifecycleEvent APR/OpenSSL configuration: useAprConnector [false], useOpenSSL [true]
17-Oct-2021 10:02:35.130 INFO [main] org.apache.catalina.core.AprLifecycleListener.lifecycleEvent Loaded Apache Tomcat Native library [1.2.32-dev] using APR version [1.7.1-dev].
17-Oct-2021 10:02:35.130 INFO [main] org.apache.catalina.core.AprLifecycleListener.lifecycleEvent APR capabilities: IPv6 [true], sendfile [true], accept filters [false], random [true], UDS [{4}].
17-Oct-2021 10:02:35.130 INFO [main] org.apache.catalina.core.AprLifecycleListener.lifecycleEvent APR/OpenSSL configuration: useAprConnector [false], useOpenSSL [true]
17-Oct-2021 10:02:35.130 INFO [main] org.apache.catalina.core.AprLifecycleListener.lifecycleEvent Loaded Apache Tomcat Native library [1.2.32-dev] using APR version [1.7.1-dev].
17-Oct-2021 10:02:35.130 INFO [main] org.apache.catalina.core.AprLifecycleListener.lifecycleEvent APR capabilities: IPv6 [true], sendfile [true], accept filters [false], random [true], UDS [{4}].
17-Oct-2021 10:02:35.130 INFO [main] org.apache.catalina.core.AprLifecycleListener.lifecycleEvent APR/OpenSSL configuration: useAprConnector [false], useOpenSSL [true]
17-Oct-2021 10:02:35.130 INFO [main] org.apache.catalina.core.AprLifecycleListener.lifecycleEvent Loaded Apache Tomcat Native library [1.2.32-dev] using APR version [1.7.1-dev].
17-Oct-2021 10:02:35.130 INFO [main] org.apache.catalina.core.AprLifecycleListener.lifecycleEvent APR capabilities: IPv6 [true], sendfile [true], accept filters [false], random [true], UDS [{4}].
17-Oct-2021 10:02:35.130 INFO [main] org.apache.catalina.core.AprLifecycleListener.lifecycleEvent APR/OpenSSL configuration: useAprConnector [false], useOpenSSL [true]
17-Oct-2021 10:02:35.130 INFO [main] org.apache.catalina.core.AprLifecycleListener.lifecycleEvent Loaded Apache Tomcat Native library [1.2.32-dev] using APR version [1.7.1-dev].
17-Oct-2021 10:02:35.131 INFO [main] org.apache.catalina.core.AprLifecycleListener.lifecycleEvent APR capabilities: IPv6 [true], sendfile [true], accept filters [false], random [true], UDS [{4}].
17-Oct-2021 10:02:35.131 INFO [main] org.apache.catalina.core.AprLifecycleListener.lifecycleEvent APR/OpenSSL configuration: useAprConnector [false], useOpenSSL [true]
17-Oct-2021 10:02:35.131 INFO [main] org.apache.catalina.core.AprLifecycleListener.lifecycleEvent Loaded Apache Tomcat Native library [1.2.32-dev] using APR version [1.7.1-dev].
17-Oct-2021 10:02:35.131 INFO [main] org.apache.catalina.core.AprLifecycleListener.lifecycleEvent APR capabilities: IPv6 [true], sendfile [true], accept filters [false], random [true], UDS [{4}].
17-Oct-2021 10:02:35.131 INFO [main] org.apache.catalina.core.AprLifecycleListener.lifecycleEvent APR/OpenSSL configuration: useAprConnector [false], useOpenSSL [true]
17-Oct-2021 10:02:35.131 INFO [main] org.apache.catalina.core.AprLifecycleListener.lifecycleEvent Loaded Apache Tomcat Native library [1.2.32-dev] using APR version [1.7.1-dev].
17-Oct-2021 10:02:35.131 INFO [main] org.apache.catalina.core.AprLifecycleListener.lifecycleEvent APR capabilities: IPv6 [true], sendfile [true], accept filters [false], random [true], UDS [{4}].
17-Oct-2021 10:02:35.131 INFO [main] org.apache.catalina.core.AprLifecycleListener.lifecycleEvent APR/OpenSSL configuration: useAprConnector [false], useOpenSSL [true]
17-Oct-2021 10:02:35.131 INFO [main] org.apache.catalina.core.AprLifecycleListener.initializeSSL OpenSSL successfully initialized [OpenSSL 1.1.1m-dev  xx XXX xxxx]
17-Oct-2021 10:02:35.132 INFO [main] org.apache.coyote.AbstractProtocol.init Initializing ProtocolHandler ["http-apr-127.0.0.1-auto-38"]
17-Oct-2021 10:02:35.132 INFO [main] org.apache.catalina.core.StandardService.startInternal Starting service [Tomcat]
17-Oct-2021 10:02:35.132 INFO [main] org.apache.catalina.core.StandardEngine.startInternal Starting Servlet engine: [Apache Tomcat/8.5.72-dev]
17-Oct-2021 10:02:35.140 INFO [main] org.apache.coyote.AbstractProtocol.start Starting ProtocolHandler ["http-apr-127.0.0.1-auto-38-34373"]
17-Oct-2021 10:02:35.149 INFO [main] org.apache.coyote.AbstractProtocol.pause Pausing ProtocolHandler ["http-apr-127.0.0.1-auto-38-34373"]
17-Oct-2021 10:02:35.154 INFO [main] org.apache.catalina.core.StandardService.stopInternal Stopping service [Tomcat]
17-Oct-2021 10:02:35.158 INFO [main] org.apache.coyote.AbstractProtocol.stop Stopping ProtocolHandler ["http-apr-127.0.0.1-auto-38-34373"]
17-Oct-2021 10:02:35.209 INFO [main] org.apache.coyote.AbstractProtocol.destroy Destroying ProtocolHandler ["http-apr-127.0.0.1-auto-38-34373"]
17-Oct-2021 10:02:35.212 INFO [main] org.apache.catalina.startup.LoggingBaseTest.setUp Starting test case [testSetCharacterEncoding01]
17-Oct-2021 10:02:35.213 INFO [main] org.apache.coyote.AbstractProtocol.destroy Destroying ProtocolHandler ["http-apr-127.0.0.1-auto-39"]
17-Oct-2021 10:02:35.213 INFO [main] org.apache.catalina.startup.LoggingBaseTest.setUp Starting test case [testSetCharacterEncoding02]
17-Oct-2021 10:02:35.214 INFO [main] org.apache.coyote.AbstractProtocol.destroy Destroying ProtocolHandler ["http-apr-127.0.0.1-auto-40"]
17-Oct-2021 10:02:35.214 INFO [main] org.apache.catalina.startup.LoggingBaseTest.setUp Starting test case [testSetCharacterEncoding03]
17-Oct-2021 10:02:35.215 INFO [main] org.apache.coyote.AbstractProtocol.destroy Destroying ProtocolHandler ["http-apr-127.0.0.1-auto-41"]
17-Oct-2021 10:02:35.215 INFO [main] org.apache.catalina.startup.LoggingBaseTest.setUp Starting test case [testSetCharacterEncoding04]
17-Oct-2021 10:02:35.216 INFO [main] org.apache.coyote.AbstractProtocol.destroy Destroying ProtocolHandler ["http-apr-127.0.0.1-auto-42"]
17-Oct-2021 10:02:35.216 INFO [main] org.apache.catalina.startup.LoggingBaseTest.setUp Starting test case [testSetCharacterEncoding05]
17-Oct-2021 10:02:35.217 INFO [main] org.apache.coyote.AbstractProtocol.destroy Destroying ProtocolHandler ["http-apr-127.0.0.1-auto-43"]
17-Oct-2021 10:02:35.217 INFO [main] org.apache.catalina.startup.LoggingBaseTest.setUp Starting test case [testSetCharacterEncoding06]
17-Oct-2021 10:02:35.218 WARNING [main] org.apache.catalina.connector.Response.setCharacterEncoding The encoding [unknown] is not recognised by the JRE
	java.lang.IllegalArgumentException: java.io.UnsupportedEncodingException: The character encoding [unknown] is not supported
		at org.apache.coyote.Response.setCharacterEncoding(Response.java:485)
		at org.apache.catalina.connector.Response.setCharacterEncoding(Response.java:823)
		at org.apache.catalina.connector.TestResponse.testSetCharacterEncoding06(TestResponse.java:720)
		at java.base/jdk.internal.reflect.NativeMethodAccessorImpl.invoke0(Native Method)
		at java.base/jdk.internal.reflect.NativeMethodAccessorImpl.invoke(NativeMethodAccessorImpl.java:62)
		at java.base/jdk.internal.reflect.DelegatingMethodAccessorImpl.invoke(DelegatingMethodAccessorImpl.java:43)
		at java.base/java.lang.reflect.Method.invoke(Method.java:566)
		at org.junit.runners.model.FrameworkMethod$1.runReflectiveCall(FrameworkMethod.java:59)
		at org.junit.internal.runners.model.ReflectiveCallable.run(ReflectiveCallable.java:12)
		at org.junit.runners.model.FrameworkMethod.invokeExplosively(FrameworkMethod.java:61)
		at org.junit.internal.runners.statements.InvokeMethod.evaluate(InvokeMethod.java:17)
		at org.junit.internal.runners.statements.ExpectException.evaluate(ExpectException.java:19)
		at org.junit.internal.runners.statements.RunBefores.evaluate(RunBefores.java:26)
		at org.junit.internal.runners.statements.RunAfters.evaluate(RunAfters.java:27)
		at org.junit.rules.TestWatcher$1.evaluate(TestWatcher.java:61)
		at org.junit.runners.ParentRunner$3.evaluate(ParentRunner.java:306)
		at org.junit.runners.BlockJUnit4ClassRunner$1.evaluate(BlockJUnit4ClassRunner.java:100)
		at org.junit.runners.ParentRunner.runLeaf(ParentRunner.java:366)
		at org.junit.runners.BlockJUnit4ClassRunner.runChild(BlockJUnit4ClassRunner.java:103)
		at org.junit.runners.BlockJUnit4ClassRunner.runChild(BlockJUnit4ClassRunner.java:63)
		at org.junit.runners.ParentRunner$4.run(ParentRunner.java:331)
		at org.junit.runners.ParentRunner$1.schedule(ParentRunner.java:79)
		at org.junit.runners.ParentRunner.runChildren(ParentRunner.java:329)
		at org.junit.runners.ParentRunner.access$100(ParentRunner.java:66)
		at org.junit.runners.ParentRunner$2.evaluate(ParentRunner.java:293)
		at org.junit.internal.runners.statements.RunBefores.evaluate(RunBefores.java:26)
		at org.junit.internal.runners.statements.RunAfters.evaluate(RunAfters.java:27)
		at org.junit.runners.ParentRunner$3.evaluate(ParentRunner.java:306)
		at org.junit.runners.ParentRunner.run(ParentRunner.java:413)
		at junit.framework.JUnit4TestAdapter.run(JUnit4TestAdapter.java:50)
		at org.apache.tools.ant.taskdefs.optional.junit.JUnitTestRunner.run(JUnitTestRunner.java:535)
		at org.apache.tools.ant.taskdefs.optional.junit.JUnitTestRunner.launch(JUnitTestRunner.java:1197)
		at org.apache.tools.ant.taskdefs.optional.junit.JUnitTestRunner.main(JUnitTestRunner.java:1042)
	Caused by: java.io.UnsupportedEncodingException: The character encoding [unknown] is not supported
		at org.apache.tomcat.util.buf.B2CConverter.getCharsetLower(B2CConverter.java:87)
		at org.apache.tomcat.util.buf.B2CConverter.getCharset(B2CConverter.java:62)
		at org.apache.coyote.Response.setCharacterEncoding(Response.java:483)
		... 32 more
17-Oct-2021 10:02:35.219 WARNING [main] org.apache.catalina.connector.Response.setCharacterEncoding The encoding [unknown] is not recognised by the JRE
	java.lang.IllegalArgumentException: java.io.UnsupportedEncodingException: The character encoding [unknown] is not supported
		at org.apache.coyote.Response.setCharacterEncoding(Response.java:485)
		at org.apache.catalina.connector.Response.setCharacterEncoding(Response.java:823)
		at org.apache.catalina.connector.Response.getWriter(Response.java:603)
		at org.apache.catalina.connector.TestResponse.testSetCharacterEncoding06(TestResponse.java:722)
		at java.base/jdk.internal.reflect.NativeMethodAccessorImpl.invoke0(Native Method)
		at java.base/jdk.internal.reflect.NativeMethodAccessorImpl.invoke(NativeMethodAccessorImpl.java:62)
		at java.base/jdk.internal.reflect.DelegatingMethodAccessorImpl.invoke(DelegatingMethodAccessorImpl.java:43)
		at java.base/java.lang.reflect.Method.invoke(Method.java:566)
		at org.junit.runners.model.FrameworkMethod$1.runReflectiveCall(FrameworkMethod.java:59)
		at org.junit.internal.runners.model.ReflectiveCallable.run(ReflectiveCallable.java:12)
		at org.junit.runners.model.FrameworkMethod.invokeExplosively(FrameworkMethod.java:61)

Continuation...

		at org.junit.internal.runners.statements.InvokeMethod.evaluate(InvokeMethod.java:17)
		at org.junit.internal.runners.statements.ExpectException.evaluate(ExpectException.java:19)
		at org.junit.internal.runners.statements.RunBefores.evaluate(RunBefores.java:26)
		at org.junit.internal.runners.statements.RunAfters.evaluate(RunAfters.java:27)
		at org.junit.rules.TestWatcher$1.evaluate(TestWatcher.java:61)
		at org.junit.runners.ParentRunner$3.evaluate(ParentRunner.java:306)
		at org.junit.runners.BlockJUnit4ClassRunner$1.evaluate(BlockJUnit4ClassRunner.java:100)
		at org.junit.runners.ParentRunner.runLeaf(ParentRunner.java:366)
		at org.junit.runners.BlockJUnit4ClassRunner.runChild(BlockJUnit4ClassRunner.java:103)
		at org.junit.runners.BlockJUnit4ClassRunner.runChild(BlockJUnit4ClassRunner.java:63)
		at org.junit.runners.ParentRunner$4.run(ParentRunner.java:331)
		at org.junit.runners.ParentRunner$1.schedule(ParentRunner.java:79)
		at org.junit.runners.ParentRunner.runChildren(ParentRunner.java:329)
		at org.junit.runners.ParentRunner.access$100(ParentRunner.java:66)
		at org.junit.runners.ParentRunner$2.evaluate(ParentRunner.java:293)
		at org.junit.internal.runners.statements.RunBefores.evaluate(RunBefores.java:26)
		at org.junit.internal.runners.statements.RunAfters.evaluate(RunAfters.java:27)
		at org.junit.runners.ParentRunner$3.evaluate(ParentRunner.java:306)
		at org.junit.runners.ParentRunner.run(ParentRunner.java:413)
		at junit.framework.JUnit4TestAdapter.run(JUnit4TestAdapter.java:50)
		at org.apache.tools.ant.taskdefs.optional.junit.JUnitTestRunner.run(JUnitTestRunner.java:535)
		at org.apache.tools.ant.taskdefs.optional.junit.JUnitTestRunner.launch(JUnitTestRunner.java:1197)
		at org.apache.tools.ant.taskdefs.optional.junit.JUnitTestRunner.main(JUnitTestRunner.java:1042)
	Caused by: java.io.UnsupportedEncodingException: The character encoding [unknown] is not supported
		at org.apache.tomcat.util.buf.B2CConverter.getCharsetLower(B2CConverter.java:87)
		at org.apache.tomcat.util.buf.B2CConverter.getCharset(B2CConverter.java:62)
		at org.apache.coyote.Response.setCharacterEncoding(Response.java:483)
		... 33 more
17-Oct-2021 10:02:35.219 INFO [main] org.apache.coyote.AbstractProtocol.destroy Destroying ProtocolHandler ["http-apr-127.0.0.1-auto-44"]
17-Oct-2021 10:02:35.220 INFO [main] org.apache.catalina.startup.LoggingBaseTest.setUp Starting test case [testSetCharacterEncoding07]
17-Oct-2021 10:02:35.220 WARNING [main] org.apache.catalina.connector.Response.setCharacterEncoding The encoding [unknown] is not recognised by the JRE
	java.lang.IllegalArgumentException: java.io.UnsupportedEncodingException: The character encoding [unknown] is not supported
		at org.apache.coyote.Response.setCharacterEncoding(Response.java:485)
		at org.apache.catalina.connector.Response.setCharacterEncoding(Response.java:823)
		at org.apache.catalina.connector.TestResponse.testSetCharacterEncoding07(TestResponse.java:732)
		at java.base/jdk.internal.reflect.NativeMethodAccessorImpl.invoke0(Native Method)
		at java.base/jdk.internal.reflect.NativeMethodAccessorImpl.invoke(NativeMethodAccessorImpl.java:62)
		at java.base/jdk.internal.reflect.DelegatingMethodAccessorImpl.invoke(DelegatingMethodAccessorImpl.java:43)
		at java.base/java.lang.reflect.Method.invoke(Method.java:566)
		at org.junit.runners.model.FrameworkMethod$1.runReflectiveCall(FrameworkMethod.java:59)
		at org.junit.internal.runners.model.ReflectiveCallable.run(ReflectiveCallable.java:12)
		at org.junit.runners.model.FrameworkMethod.invokeExplosively(FrameworkMethod.java:61)
		at org.junit.internal.runners.statements.InvokeMethod.evaluate(InvokeMethod.java:17)
		at org.junit.internal.runners.statements.RunBefores.evaluate(RunBefores.java:26)
		at org.junit.internal.runners.statements.RunAfters.evaluate(RunAfters.java:27)
		at org.junit.rules.TestWatcher$1.evaluate(TestWatcher.java:61)
		at org.junit.runners.ParentRunner$3.evaluate(ParentRunner.java:306)
		at org.junit.runners.BlockJUnit4ClassRunner$1.evaluate(BlockJUnit4ClassRunner.java:100)
		at org.junit.runners.ParentRunner.runLeaf(ParentRunner.java:366)
		at org.junit.runners.BlockJUnit4ClassRunner.runChild(BlockJUnit4ClassRunner.java:103)
		at org.junit.runners.BlockJUnit4ClassRunner.runChild(BlockJUnit4ClassRunner.java:63)
		at org.junit.runners.ParentRunner$4.run(ParentRunner.java:331)
		at org.junit.runners.ParentRunner$1.schedule(ParentRunner.java:79)
		at org.junit.runners.ParentRunner.runChildren(ParentRunner.java:329)
		at org.junit.runners.ParentRunner.access$100(ParentRunner.java:66)
		at org.junit.runners.ParentRunner$2.evaluate(ParentRunner.java:293)
		at org.junit.internal.runners.statements.RunBefores.evaluate(RunBefores.java:26)
		at org.junit.internal.runners.statements.RunAfters.evaluate(RunAfters.java:27)
		at org.junit.runners.ParentRunner$3.evaluate(ParentRunner.java:306)
		at org.junit.runners.ParentRunner.run(ParentRunner.java:413)
		at junit.framework.JUnit4TestAdapter.run(JUnit4TestAdapter.java:50)
		at org.apache.tools.ant.taskdefs.optional.junit.JUnitTestRunner.run(JUnitTestRunner.java:535)
		at org.apache.tools.ant.taskdefs.optional.junit.JUnitTestRunner.launch(JUnitTestRunner.java:1197)
		at org.apache.tools.ant.taskdefs.optional.junit.JUnitTestRunner.main(JUnitTestRunner.java:1042)
	Caused by: java.io.UnsupportedEncodingException: The character encoding [unknown] is not supported
		at org.apache.tomcat.util.buf.B2CConverter.getCharsetLower(B2CConverter.java:87)
		at org.apache.tomcat.util.buf.B2CConverter.getCharset(B2CConverter.java:62)
		at org.apache.coyote.Response.setCharacterEncoding(Response.java:483)
		... 31 more
17-Oct-2021 10:02:35.221 INFO [main] org.apache.coyote.AbstractProtocol.destroy Destroying ProtocolHandler ["http-apr-127.0.0.1-auto-45"]
17-Oct-2021 10:02:35.221 INFO [main] org.apache.catalina.startup.LoggingBaseTest.setUp Starting test case [testSetCharacterEncoding08]
17-Oct-2021 10:02:35.222 INFO [main] org.apache.coyote.AbstractProtocol.destroy Destroying ProtocolHandler ["http-apr-127.0.0.1-auto-46"]
17-Oct-2021 10:02:35.222 INFO [main] org.apache.catalina.startup.LoggingBaseTest.setUp Starting test case [testEncodeURL01]
17-Oct-2021 10:02:35.223 INFO [main] org.apache.coyote.AbstractProtocol.destroy Destroying ProtocolHandler ["http-apr-127.0.0.1-auto-47"]
17-Oct-2021 10:02:35.223 INFO [main] org.apache.catalina.startup.LoggingBaseTest.setUp Starting test case [testEncodeURL02]
17-Oct-2021 10:02:35.224 INFO [main] org.apache.coyote.AbstractProtocol.destroy Destroying ProtocolHandler ["http-apr-127.0.0.1-auto-48"]
17-Oct-2021 10:02:35.224 INFO [main] org.apache.catalina.startup.LoggingBaseTest.setUp Starting test case [testEncodeURL03]
17-Oct-2021 10:02:35.225 INFO [main] org.apache.coyote.AbstractProtocol.destroy Destroying ProtocolHandler ["http-apr-127.0.0.1-auto-49"]
17-Oct-2021 10:02:35.225 INFO [main] org.apache.catalina.startup.LoggingBaseTest.setUp Starting test case [testEncodeURL04]
17-Oct-2021 10:02:35.226 INFO [main] org.apache.coyote.AbstractProtocol.destroy Destroying ProtocolHandler ["http-apr-127.0.0.1-auto-50"]
17-Oct-2021 10:02:35.226 INFO [main] org.apache.catalina.startup.LoggingBaseTest.setUp Starting test case [testEncodeURL06]
17-Oct-2021 10:02:35.227 INFO [main] org.apache.coyote.AbstractProtocol.destroy Destroying ProtocolHandler ["http-apr-127.0.0.1-auto-51"]
17-Oct-2021 10:02:35.227 INFO [main] org.apache.catalina.startup.LoggingBaseTest.setUp Starting test case [testEncodeURL07]
17-Oct-2021 10:02:35.228 INFO [main] org.apache.coyote.AbstractProtocol.destroy Destroying ProtocolHandler ["http-apr-127.0.0.1-auto-52"]
17-Oct-2021 10:02:35.228 INFO [main] org.apache.catalina.startup.LoggingBaseTest.setUp Starting test case [testEncodeURL08]
17-Oct-2021 10:02:35.229 INFO [main] org.apache.coyote.AbstractProtocol.destroy Destroying ProtocolHandler ["http-apr-127.0.0.1-auto-53"]
17-Oct-2021 10:02:35.229 INFO [main] org.apache.catalina.startup.LoggingBaseTest.setUp Starting test case [testEncodeURL09]
17-Oct-2021 10:02:35.230 INFO [main] org.apache.coyote.AbstractProtocol.destroy Destroying ProtocolHandler ["http-apr-127.0.0.1-auto-54"]
17-Oct-2021 10:02:35.230 INFO [main] org.apache.catalina.startup.LoggingBaseTest.setUp Starting test case [testEncodeURL10]
17-Oct-2021 10:02:35.231 INFO [main] org.apache.coyote.AbstractProtocol.destroy Destroying ProtocolHandler ["http-apr-127.0.0.1-auto-55"]
17-Oct-2021 10:02:35.231 INFO [main] org.apache.catalina.startup.LoggingBaseTest.setUp Starting test case [testEncodeURL11]
17-Oct-2021 10:02:35.232 INFO [main] org.apache.coyote.AbstractProtocol.destroy Destroying ProtocolHandler ["http-apr-127.0.0.1-auto-56"]
17-Oct-2021 10:02:35.232 INFO [main] org.apache.catalina.startup.LoggingBaseTest.setUp Starting test case [testEncodeURL12]
17-Oct-2021 10:02:35.233 INFO [main] org.apache.coyote.AbstractProtocol.destroy Destroying ProtocolHandler ["http-apr-127.0.0.1-auto-57"]
17-Oct-2021 10:02:35.233 INFO [main] org.apache.catalina.startup.LoggingBaseTest.setUp Starting test case [testEncodeURL13]
17-Oct-2021 10:02:35.234 INFO [main] org.apache.coyote.AbstractProtocol.destroy Destroying ProtocolHandler ["http-apr-127.0.0.1-auto-58"]
17-Oct-2021 10:02:35.234 INFO [main] org.apache.catalina.startup.LoggingBaseTest.setUp Starting test case [testEncodeURL14]
17-Oct-2021 10:02:35.235 INFO [main] org.apache.coyote.AbstractProtocol.destroy Destroying ProtocolHandler ["http-apr-127.0.0.1-auto-59"]
17-Oct-2021 10:02:35.235 INFO [main] org.apache.catalina.startup.LoggingBaseTest.setUp Starting test case [testEncodeURL15]
17-Oct-2021 10:02:35.236 INFO [main] org.apache.coyote.AbstractProtocol.destroy Destroying ProtocolHandler ["http-apr-127.0.0.1-auto-60"]
17-Oct-2021 10:02:35.236 INFO [main] org.apache.catalina.startup.LoggingBaseTest.setUp Starting test case [testEncodeURL16]
17-Oct-2021 10:02:35.237 INFO [main] org.apache.coyote.AbstractProtocol.destroy Destroying ProtocolHandler ["http-apr-127.0.0.1-auto-61"]
17-Oct-2021 10:02:35.237 INFO [main] org.apache.catalina.startup.LoggingBaseTest.setUp Starting test case [testEncodeRedirectURL01]
17-Oct-2021 10:02:35.238 INFO [main] org.apache.coyote.AbstractProtocol.destroy Destroying ProtocolHandler ["http-apr-127.0.0.1-auto-62"]
17-Oct-2021 10:02:35.238 INFO [main] org.apache.catalina.startup.LoggingBaseTest.setUp Starting test case [testEncodeRedirectURL02]
17-Oct-2021 10:02:35.239 INFO [main] org.apache.coyote.AbstractProtocol.destroy Destroying ProtocolHandler ["http-apr-127.0.0.1-auto-63"]
17-Oct-2021 10:02:35.239 INFO [main] org.apache.catalina.startup.LoggingBaseTest.setUp Starting test case [testEncodeRedirectURL03]
17-Oct-2021 10:02:35.240 INFO [main] org.apache.coyote.AbstractProtocol.destroy Destroying ProtocolHandler ["http-apr-127.0.0.1-auto-64"]
17-Oct-2021 10:02:35.240 INFO [main] org.apache.catalina.startup.LoggingBaseTest.setUp Starting test case [testEncodeRedirectURL04]
17-Oct-2021 10:02:35.241 INFO [main] org.apache.coyote.AbstractProtocol.destroy Destroying ProtocolHandler ["http-apr-127.0.0.1-auto-65"]
17-Oct-2021 10:02:35.241 INFO [main] org.apache.catalina.startup.LoggingBaseTest.setUp Starting test case [testEncodeRedirectURL05]
17-Oct-2021 10:02:35.242 INFO [main] org.apache.coyote.AbstractProtocol.destroy Destroying ProtocolHandler ["http-apr-127.0.0.1-auto-66"]
17-Oct-2021 10:02:35.242 INFO [main] org.apache.catalina.startup.LoggingBaseTest.setUp Starting test case [testEncodeRedirectURL06]
17-Oct-2021 10:02:35.243 INFO [main] org.apache.coyote.AbstractProtocol.destroy Destroying ProtocolHandler ["http-apr-127.0.0.1-auto-67"]
17-Oct-2021 10:02:35.243 INFO [main] org.apache.catalina.startup.LoggingBaseTest.setUp Starting test case [testEncodeRedirectURL07]
17-Oct-2021 10:02:35.244 INFO [main] org.apache.coyote.AbstractProtocol.destroy Destroying ProtocolHandler ["http-apr-127.0.0.1-auto-68"]
17-Oct-2021 10:02:35.244 INFO [main] org.apache.catalina.startup.LoggingBaseTest.setUp Starting test case [testEncodeRedirectURL08]
17-Oct-2021 10:02:35.245 INFO [main] org.apache.coyote.AbstractProtocol.destroy Destroying ProtocolHandler ["http-apr-127.0.0.1-auto-69"]
17-Oct-2021 10:02:35.245 INFO [main] org.apache.catalina.startup.LoggingBaseTest.setUp Starting test case [testEncodeRedirectURL09]
17-Oct-2021 10:02:35.246 INFO [main] org.apache.coyote.AbstractProtocol.destroy Destroying ProtocolHandler ["http-apr-127.0.0.1-auto-70"]
17-Oct-2021 10:02:35.246 INFO [main] org.apache.catalina.startup.LoggingBaseTest.setUp Starting test case [testEncodeRedirectURL10]
17-Oct-2021 10:02:35.247 INFO [main] org.apache.coyote.AbstractProtocol.destroy Destroying ProtocolHandler ["http-apr-127.0.0.1-auto-71"]
17-Oct-2021 10:02:35.247 INFO [main] org.apache.catalina.startup.LoggingBaseTest.setUp Starting test case [testEncodeRedirectURL11]
17-Oct-2021 10:02:35.248 INFO [main] org.apache.coyote.AbstractProtocol.destroy Destroying ProtocolHandler ["http-apr-127.0.0.1-auto-72"]
17-Oct-2021 10:02:35.248 INFO [main] org.apache.catalina.startup.LoggingBaseTest.setUp Starting test case [testEncodeRedirectURL12]
17-Oct-2021 10:02:35.249 INFO [main] org.apache.coyote.AbstractProtocol.destroy Destroying ProtocolHandler ["http-apr-127.0.0.1-auto-73"]
17-Oct-2021 10:02:35.249 INFO [main] org.apache.catalina.startup.LoggingBaseTest.setUp Starting test case [testEncodeRedirectURL13]
17-Oct-2021 10:02:35.250 INFO [main] org.apache.coyote.AbstractProtocol.destroy Destroying ProtocolHandler ["http-apr-127.0.0.1-auto-74"]
17-Oct-2021 10:02:35.250 INFO [main] org.apache.catalina.startup.LoggingBaseTest.setUp Starting test case [testEncodeRedirectURL14]
17-Oct-2021 10:02:35.251 INFO [main] org.apache.coyote.AbstractProtocol.destroy Destroying ProtocolHandler ["http-apr-127.0.0.1-auto-75"]
17-Oct-2021 10:02:35.251 INFO [main] org.apache.catalina.startup.LoggingBaseTest.setUp Starting test case [testEncodeRedirectURL15]
17-Oct-2021 10:02:35.252 INFO [main] org.apache.coyote.AbstractProtocol.destroy Destroying ProtocolHandler ["http-apr-127.0.0.1-auto-76"]
17-Oct-2021 10:02:35.252 INFO [main] org.apache.catalina.startup.LoggingBaseTest.setUp Starting test case [testEncodeRedirectURL16]
17-Oct-2021 10:02:35.253 INFO [main] org.apache.coyote.AbstractProtocol.destroy Destroying ProtocolHandler ["http-apr-127.0.0.1-auto-77"]
------------- ---------------- ---------------

Testcase: testSendRedirect01 took 0.269 sec
Testcase: testSendRedirect02 took 0.002 sec
Testcase: testSendRedirect03 took 0.002 sec
Testcase: testSetLocale01 took 0.005 sec
Testcase: testSetLocale02 took 0.002 sec
Testcase: testSetLocale03 took 0.002 sec
Testcase: testSetLocale04 took 0.002 sec
Testcase: testSetLocale05 took 0.003 sec
Testcase: testSetLocale06 took 0.003 sec
Testcase: testSetLocale07 took 0.012 sec
Testcase: testSetLocale08 took 0.005 sec
Testcase: testBug49598 took 0.503 sec
Testcase: testBug52811 took 0.088 sec
Testcase: testSetContentType01 took 0.002 sec
Testcase: testSetContentType02 took 0.001 sec
Testcase: testSetContentType03 took 0.003 sec
Testcase: testSetContentType04 took 0.001 sec
Testcase: testSetContentType05 took 0.003 sec
Testcase: testSetContentType06 took 0.002 sec
Testcase: testBug53062a took 0.003 sec
Testcase: testBug53062b took 0.001 sec
Testcase: testBug53062c took 0.001 sec
Testcase: testBug53062d took 0.002 sec
Testcase: testBug53062e took 0.001 sec
Testcase: testBug53062f took 0.001 sec
Testcase: testBug53062g took 0.001 sec
Testcase: testBug53062h took 0.001 sec
Testcase: testBug53062i took 0.001 sec
Testcase: testBug53062j took 0.001 sec
Testcase: testBug53062k took 0.001 sec
Testcase: testBug53062l took 0.001 sec
Testcase: testBug53062m took 0.001 sec
Testcase: testBug53062n took 0.001 sec
Testcase: testBug53062o took 0.001 sec
Testcase: testBug53062p took 0.001 sec
Testcase: testBug53469a took 0 sec
Testcase: testBug53469b took 0.001 sec
Testcase: testCharset took 0.085 sec
Testcase: testSetCharacterEncoding01 took 0.002 sec
Testcase: testSetCharacterEncoding02 took 0.001 sec
Testcase: testSetCharacterEncoding03 took 0.001 sec
Testcase: testSetCharacterEncoding04 took 0.001 sec
Testcase: testSetCharacterEncoding05 took 0.001 sec
Testcase: testSetCharacterEncoding06 took 0.002 sec
Testcase: testSetCharacterEncoding07 took 0.001 sec
Testcase: testSetCharacterEncoding08 took 0.001 sec
Testcase: testEncodeURL01 took 0.001 sec
Testcase: testEncodeURL02 took 0.001 sec
Testcase: testEncodeURL03 took 0.001 sec
Testcase: testEncodeURL04 took 0.001 sec
Testcase: testEncodeURL06 took 0.001 sec
Testcase: testEncodeURL07 took 0.001 sec
Testcase: testEncodeURL08 took 0.001 sec
Testcase: testEncodeURL09 took 0.001 sec
Testcase: testEncodeURL10 took 0.001 sec
Testcase: testEncodeURL11 took 0.001 sec
Testcase: testEncodeURL12 took 0.001 sec
Testcase: testEncodeURL13 took 0.001 sec
Testcase: testEncodeURL14 took 0.001 sec
Testcase: testEncodeURL15 took 0.001 sec
Testcase: testEncodeURL16 took 0.001 sec
Testcase: testEncodeRedirectURL01 took 0.001 sec
Testcase: testEncodeRedirectURL02 took 0.001 sec
Testcase: testEncodeRedirectURL03 took 0.001 sec
Testcase: testEncodeRedirectURL04 took 0.001 sec
Testcase: testEncodeRedirectURL05 took 0.001 sec
Testcase: testEncodeRedirectURL06 took 0.001 sec
Testcase: testEncodeRedirectURL07 took 0.001 sec
Testcase: testEncodeRedirectURL08 took 0.001 sec
Testcase: testEncodeRedirectURL09 took 0.001 sec
Testcase: testEncodeRedirectURL10 took 0.001 sec
Testcase: testEncodeRedirectURL11 took 0.001 sec
Testcase: testEncodeRedirectURL12 took 0.001 sec
Testcase: testEncodeRedirectURL13 took 0.001 sec
Testcase: testEncodeRedirectURL14 took 0.001 sec
Testcase: testEncodeRedirectURL15 took 0.001 sec
Testcase: testEncodeRedirectURL16 took 0.001 sec

Apache Gump, Gump, Apache, the Apache feather logo, and the Apache Gump project logos are trademarks of The Apache Software Foundation.

Last Updated: Sun, 17 Oct 2021 06:00:05 ().Python Logo