Run| Workspace| Log| Issues| Fixes| Pre-reqs| Stats| XRef| Maven Repository Proxy Log Gump Logo

Details

File Contents

Testsuite: org.apache.catalina.startup.TestTomcat
Tests run: 26, Failures: 0, Errors: 0, Skipped: 0, Time elapsed: 17.952 sec
------------- Standard Error -----------------
26-Jun-2022 02:58:59.489 INFO [main] org.apache.catalina.startup.LoggingBaseTest.setUp Starting test case [testProgrammatic]
26-Jun-2022 02:59:00.040 INFO [main] org.apache.coyote.AbstractProtocol.init Initializing ProtocolHandler ["http-nio2-127.0.0.1-auto-1"]
26-Jun-2022 02:59:00.071 INFO [main] org.apache.catalina.core.StandardService.startInternal Starting service [Tomcat]
26-Jun-2022 02:59:00.071 INFO [main] org.apache.catalina.core.StandardEngine.startInternal Starting Servlet engine: [Apache Tomcat/10.0.23-dev]
26-Jun-2022 02:59:00.553 INFO [main] org.apache.coyote.AbstractProtocol.start Starting ProtocolHandler ["http-nio2-127.0.0.1-auto-1-43799"]
26-Jun-2022 02:59:00.636 INFO [main] org.apache.coyote.AbstractProtocol.pause Pausing ProtocolHandler ["http-nio2-127.0.0.1-auto-1-43799"]
26-Jun-2022 02:59:00.638 INFO [main] org.apache.catalina.core.StandardService.stopInternal Stopping service [Tomcat]
26-Jun-2022 02:59:00.648 INFO [main] org.apache.coyote.AbstractProtocol.stop Stopping ProtocolHandler ["http-nio2-127.0.0.1-auto-1-43799"]
26-Jun-2022 02:59:00.649 INFO [main] org.apache.coyote.AbstractProtocol.destroy Destroying ProtocolHandler ["http-nio2-127.0.0.1-auto-1-43799"]
26-Jun-2022 02:59:00.662 INFO [main] org.apache.catalina.startup.LoggingBaseTest.setUp Starting test case [testGetDefaultContextPerAddWebapp]
26-Jun-2022 02:59:00.668 INFO [main] org.apache.coyote.AbstractProtocol.destroy Destroying ProtocolHandler ["http-nio2-127.0.0.1-auto-2"]
26-Jun-2022 02:59:00.669 INFO [main] org.apache.catalina.startup.LoggingBaseTest.setUp Starting test case [testGetCustomContextPerAddWebappWithHost]
26-Jun-2022 02:59:00.672 INFO [main] org.apache.coyote.AbstractProtocol.destroy Destroying ProtocolHandler ["http-nio2-127.0.0.1-auto-3"]
26-Jun-2022 02:59:00.673 INFO [main] org.apache.catalina.startup.LoggingBaseTest.setUp Starting test case [testGetWebappConfigFileFromJarNegative]
26-Jun-2022 02:59:00.674 INFO [main] org.apache.coyote.AbstractProtocol.destroy Destroying ProtocolHandler ["http-nio2-127.0.0.1-auto-4"]
26-Jun-2022 02:59:00.675 INFO [main] org.apache.catalina.startup.LoggingBaseTest.setUp Starting test case [testGetWebappConfigFileFromJar]
26-Jun-2022 02:59:00.676 INFO [main] org.apache.coyote.AbstractProtocol.destroy Destroying ProtocolHandler ["http-nio2-127.0.0.1-auto-5"]
26-Jun-2022 02:59:00.676 INFO [main] org.apache.catalina.startup.LoggingBaseTest.setUp Starting test case [testGetWebappConfigFileFromDirectoryNegative]
26-Jun-2022 02:59:00.677 INFO [main] org.apache.coyote.AbstractProtocol.destroy Destroying ProtocolHandler ["http-nio2-127.0.0.1-auto-6"]
26-Jun-2022 02:59:00.677 INFO [main] org.apache.catalina.startup.LoggingBaseTest.setUp Starting test case [testCustomContextConfig]
26-Jun-2022 02:59:00.679 INFO [main] org.apache.coyote.AbstractProtocol.init Initializing ProtocolHandler ["http-nio2-127.0.0.1-auto-7"]
26-Jun-2022 02:59:00.689 INFO [main] org.apache.catalina.core.StandardService.startInternal Starting service [Tomcat]
26-Jun-2022 02:59:00.690 INFO [main] org.apache.catalina.core.StandardEngine.startInternal Starting Servlet engine: [Apache Tomcat/10.0.23-dev]
26-Jun-2022 02:59:00.700 SEVERE [main] org.apache.catalina.core.StandardContext.startInternal One or more components marked the context as not correctly configured
26-Jun-2022 02:59:00.701 SEVERE [main] org.apache.catalina.core.StandardContext.startInternal Context [/test] startup failed due to previous errors
26-Jun-2022 02:59:00.704 INFO [main] org.apache.coyote.AbstractProtocol.start Starting ProtocolHandler ["http-nio2-127.0.0.1-auto-7-39531"]
26-Jun-2022 02:59:00.705 INFO [main] org.apache.coyote.AbstractProtocol.pause Pausing ProtocolHandler ["http-nio2-127.0.0.1-auto-7-39531"]
26-Jun-2022 02:59:00.706 INFO [main] org.apache.catalina.core.StandardService.stopInternal Stopping service [Tomcat]
26-Jun-2022 02:59:00.707 INFO [main] org.apache.coyote.AbstractProtocol.stop Stopping ProtocolHandler ["http-nio2-127.0.0.1-auto-7-39531"]
26-Jun-2022 02:59:00.707 INFO [main] org.apache.coyote.AbstractProtocol.destroy Destroying ProtocolHandler ["http-nio2-127.0.0.1-auto-7-39531"]
26-Jun-2022 02:59:00.710 INFO [main] org.apache.catalina.startup.LoggingBaseTest.setUp Starting test case [testSingleWebapp]
26-Jun-2022 02:59:00.712 INFO [main] org.apache.coyote.AbstractProtocol.init Initializing ProtocolHandler ["http-nio2-127.0.0.1-auto-8"]
26-Jun-2022 02:59:00.716 INFO [main] org.apache.catalina.core.StandardService.startInternal Starting service [Tomcat]
26-Jun-2022 02:59:00.716 INFO [main] org.apache.catalina.core.StandardEngine.startInternal Starting Servlet engine: [Apache Tomcat/10.0.23-dev]
26-Jun-2022 02:59:00.748 INFO [main] org.apache.catalina.startup.ContextConfig.getDefaultWebXmlFragment No global web.xml found
26-Jun-2022 02:59:02.074 INFO [main] org.apache.jasper.servlet.TldScanner.scanJars At least one JAR was scanned for TLDs yet contained no TLDs. Enable debug logging for this logger for a complete list of JARs that were scanned but no TLDs were found in them. Skipping unneeded JARs during scanning can improve startup time and JSP compilation time.
26-Jun-2022 02:59:02.332 INFO [main] org.apache.catalina.core.ApplicationContext.log ContextListener: contextInitialized()
26-Jun-2022 02:59:02.333 INFO [main] org.apache.catalina.core.ApplicationContext.log SessionListener: contextInitialized()
26-Jun-2022 02:59:02.334 INFO [main] org.apache.catalina.core.ApplicationContext.log ContextListener: attributeAdded('StockTicker', 'async.Stockticker@3ad2883a')
26-Jun-2022 02:59:02.356 INFO [main] org.apache.coyote.AbstractProtocol.start Starting ProtocolHandler ["http-nio2-127.0.0.1-auto-8-39055"]
26-Jun-2022 02:59:02.370 INFO [main] org.apache.coyote.AbstractProtocol.pause Pausing ProtocolHandler ["http-nio2-127.0.0.1-auto-8-39055"]
26-Jun-2022 02:59:02.371 INFO [main] org.apache.catalina.core.StandardService.stopInternal Stopping service [Tomcat]
26-Jun-2022 02:59:02.372 INFO [main] org.apache.catalina.core.ApplicationContext.log SessionListener: contextDestroyed()
26-Jun-2022 02:59:02.372 INFO [main] org.apache.catalina.core.ApplicationContext.log ContextListener: contextDestroyed()
26-Jun-2022 02:59:02.378 INFO [main] org.apache.coyote.AbstractProtocol.stop Stopping ProtocolHandler ["http-nio2-127.0.0.1-auto-8-39055"]
26-Jun-2022 02:59:02.378 INFO [main] org.apache.coyote.AbstractProtocol.destroy Destroying ProtocolHandler ["http-nio2-127.0.0.1-auto-8-39055"]
26-Jun-2022 02:59:02.384 INFO [main] org.apache.catalina.startup.LoggingBaseTest.setUp Starting test case [testBrokenWarOne]
26-Jun-2022 02:59:02.386 INFO [main] org.apache.coyote.AbstractProtocol.init Initializing ProtocolHandler ["http-nio2-127.0.0.1-auto-9"]
26-Jun-2022 02:59:02.399 INFO [main] org.apache.catalina.core.StandardService.startInternal Starting service [Tomcat]
26-Jun-2022 02:59:02.399 INFO [main] org.apache.catalina.core.StandardEngine.startInternal Starting Servlet engine: [Apache Tomcat/10.0.23-dev]
26-Jun-2022 02:59:02.403 SEVERE [main] org.apache.catalina.core.ContainerBase.startInternal A child container failed during start
	java.util.concurrent.ExecutionException: org.apache.catalina.LifecycleException: Deliberately Broken
		at java.base/java.util.concurrent.FutureTask.report(FutureTask.java:122)
		at java.base/java.util.concurrent.FutureTask.get(FutureTask.java:191)
		at org.apache.catalina.core.ContainerBase.startInternal(ContainerBase.java:926)
		at org.apache.catalina.core.StandardHost.startInternal(StandardHost.java:886)
		at org.apache.catalina.util.LifecycleBase.start(LifecycleBase.java:183)
		at org.apache.catalina.core.ContainerBase$StartChild.call(ContainerBase.java:1396)
		at org.apache.catalina.core.ContainerBase$StartChild.call(ContainerBase.java:1386)
		at java.base/java.util.concurrent.FutureTask.run(FutureTask.java:264)
		at org.apache.tomcat.util.threads.InlineExecutorService.execute(InlineExecutorService.java:75)
		at java.base/java.util.concurrent.AbstractExecutorService.submit(AbstractExecutorService.java:140)
		at org.apache.catalina.core.ContainerBase.startInternal(ContainerBase.java:919)
		at org.apache.catalina.core.StandardEngine.startInternal(StandardEngine.java:265)
		at org.apache.catalina.util.LifecycleBase.start(LifecycleBase.java:183)
		at org.apache.catalina.core.StandardService.startInternal(StandardService.java:432)
		at org.apache.catalina.util.LifecycleBase.start(LifecycleBase.java:183)
		at org.apache.catalina.core.StandardServer.startInternal(StandardServer.java:930)
		at org.apache.catalina.util.LifecycleBase.start(LifecycleBase.java:183)
		at org.apache.catalina.startup.Tomcat.start(Tomcat.java:486)
		at org.apache.catalina.startup.TomcatBaseTest$TomcatWithFastSessionIDs.start(TomcatBaseTest.java:879)
		at org.apache.catalina.startup.TestTomcat.testBrokenWarOne(TestTomcat.java:575)
		at java.base/jdk.internal.reflect.NativeMethodAccessorImpl.invoke0(Native Method)
		at java.base/jdk.internal.reflect.NativeMethodAccessorImpl.invoke(NativeMethodAccessorImpl.java:62)
		at java.base/jdk.internal.reflect.DelegatingMethodAccessorImpl.invoke(DelegatingMethodAccessorImpl.java:43)
		at java.base/java.lang.reflect.Method.invoke(Method.java:566)
		at org.junit.runners.model.FrameworkMethod$1.runReflectiveCall(FrameworkMethod.java:59)
		at org.junit.internal.runners.model.ReflectiveCallable.run(ReflectiveCallable.java:12)
		at org.junit.runners.model.FrameworkMethod.invokeExplosively(FrameworkMethod.java:61)
		at org.junit.internal.runners.statements.InvokeMethod.evaluate(InvokeMethod.java:17)
		at org.junit.internal.runners.statements.RunBefores.evaluate(RunBefores.java:26)
		at org.junit.internal.runners.statements.RunAfters.evaluate(RunAfters.java:27)
		at org.junit.rules.TestWatcher$1.evaluate(TestWatcher.java:61)
		at org.junit.runners.ParentRunner$3.evaluate(ParentRunner.java:306)
		at org.junit.runners.BlockJUnit4ClassRunner$1.evaluate(BlockJUnit4ClassRunner.java:100)
		at org.junit.runners.ParentRunner.runLeaf(ParentRunner.java:366)
		at org.junit.runners.BlockJUnit4ClassRunner.runChild(BlockJUnit4ClassRunner.java:103)
		at org.junit.runners.BlockJUnit4ClassRunner.runChild(BlockJUnit4ClassRunner.java:63)
		at org.junit.runners.ParentRunner$4.run(ParentRunner.java:331)
		at org.junit.runners.ParentRunner$1.schedule(ParentRunner.java:79)
		at org.junit.runners.ParentRunner.runChildren(ParentRunner.java:329)
		at org.junit.runners.ParentRunner.access$100(ParentRunner.java:66)
		at org.junit.runners.ParentRunner$2.evaluate(ParentRunner.java:293)
		at org.junit.internal.runners.statements.RunBefores.evaluate(RunBefores.java:26)
		at org.junit.internal.runners.statements.RunAfters.evaluate(RunAfters.java:27)
		at org.junit.runners.ParentRunner$3.evaluate(ParentRunner.java:306)
		at org.junit.runners.ParentRunner.run(ParentRunner.java:413)
		at junit.framework.JUnit4TestAdapter.run(JUnit4TestAdapter.java:50)
		at org.apache.tools.ant.taskdefs.optional.junit.JUnitTestRunner.run(JUnitTestRunner.java:535)
		at org.apache.tools.ant.taskdefs.optional.junit.JUnitTestRunner.launch(JUnitTestRunner.java:1197)
		at org.apache.tools.ant.taskdefs.optional.junit.JUnitTestRunner.main(JUnitTestRunner.java:1042)
	Caused by: org.apache.catalina.LifecycleException: Deliberately Broken
		at org.apache.catalina.startup.TestTomcat$BrokenAuthenticator.startInternal(TestTomcat.java:623)
		at org.apache.catalina.util.LifecycleBase.start(LifecycleBase.java:183)
		at org.apache.catalina.core.StandardPipeline.startInternal(StandardPipeline.java:176)
		at org.apache.catalina.util.LifecycleBase.start(LifecycleBase.java:183)
		at org.apache.catalina.core.StandardContext.startInternal(StandardContext.java:5096)
		at org.apache.catalina.util.LifecycleBase.start(LifecycleBase.java:183)
		at org.apache.catalina.core.ContainerBase$StartChild.call(ContainerBase.java:1396)
		at org.apache.catalina.core.ContainerBase$StartChild.call(ContainerBase.java:1386)
		at java.base/java.util.concurrent.FutureTask.run(FutureTask.java:264)
		at org.apache.tomcat.util.threads.InlineExecutorService.execute(InlineExecutorService.java:75)
		at java.base/java.util.concurrent.AbstractExecutorService.submit(AbstractExecutorService.java:140)
		at org.apache.catalina.core.ContainerBase.startInternal(ContainerBase.java:919)
		... 46 more
26-Jun-2022 02:59:02.405 SEVERE [main] org.apache.catalina.core.ContainerBase.startInternal A child container failed during start
	java.util.concurrent.ExecutionException: org.apache.catalina.LifecycleException: A child container failed during start
		at java.base/java.util.concurrent.FutureTask.report(FutureTask.java:122)
		at java.base/java.util.concurrent.FutureTask.get(FutureTask.java:191)
		at org.apache.catalina.core.ContainerBase.startInternal(ContainerBase.java:926)
		at org.apache.catalina.core.StandardEngine.startInternal(StandardEngine.java:265)
		at org.apache.catalina.util.LifecycleBase.start(LifecycleBase.java:183)
		at org.apache.catalina.core.StandardService.startInternal(StandardService.java:432)
		at org.apache.catalina.util.LifecycleBase.start(LifecycleBase.java:183)
		at org.apache.catalina.core.StandardServer.startInternal(StandardServer.java:930)
		at org.apache.catalina.util.LifecycleBase.start(LifecycleBase.java:183)
		at org.apache.catalina.startup.Tomcat.start(Tomcat.java:486)
		at org.apache.catalina.startup.TomcatBaseTest$TomcatWithFastSessionIDs.start(TomcatBaseTest.java:879)
		at org.apache.catalina.startup.TestTomcat.testBrokenWarOne(TestTomcat.java:575)
		at java.base/jdk.internal.reflect.NativeMethodAccessorImpl.invoke0(Native Method)
		at java.base/jdk.internal.reflect.NativeMethodAccessorImpl.invoke(NativeMethodAccessorImpl.java:62)
		at java.base/jdk.internal.reflect.DelegatingMethodAccessorImpl.invoke(DelegatingMethodAccessorImpl.java:43)
		at java.base/java.lang.reflect.Method.invoke(Method.java:566)
		at org.junit.runners.model.FrameworkMethod$1.runReflectiveCall(FrameworkMethod.java:59)
		at org.junit.internal.runners.model.ReflectiveCallable.run(ReflectiveCallable.java:12)
		at org.junit.runners.model.FrameworkMethod.invokeExplosively(FrameworkMethod.java:61)
		at org.junit.internal.runners.statements.InvokeMethod.evaluate(InvokeMethod.java:17)
		at org.junit.internal.runners.statements.RunBefores.evaluate(RunBefores.java:26)
		at org.junit.internal.runners.statements.RunAfters.evaluate(RunAfters.java:27)
		at org.junit.rules.TestWatcher$1.evaluate(TestWatcher.java:61)
		at org.junit.runners.ParentRunner$3.evaluate(ParentRunner.java:306)
		at org.junit.runners.BlockJUnit4ClassRunner$1.evaluate(BlockJUnit4ClassRunner.java:100)
		at org.junit.runners.ParentRunner.runLeaf(ParentRunner.java:366)
		at org.junit.runners.BlockJUnit4ClassRunner.runChild(BlockJUnit4ClassRunner.java:103)
		at org.junit.runners.BlockJUnit4ClassRunner.runChild(BlockJUnit4ClassRunner.java:63)
		at org.junit.runners.ParentRunner$4.run(ParentRunner.java:331)
		at org.junit.runners.ParentRunner$1.schedule(ParentRunner.java:79)
		at org.junit.runners.ParentRunner.runChildren(ParentRunner.java:329)
		at org.junit.runners.ParentRunner.access$100(ParentRunner.java:66)
		at org.junit.runners.ParentRunner$2.evaluate(ParentRunner.java:293)
		at org.junit.internal.runners.statements.RunBefores.evaluate(RunBefores.java:26)
		at org.junit.internal.runners.statements.RunAfters.evaluate(RunAfters.java:27)
		at org.junit.runners.ParentRunner$3.evaluate(ParentRunner.java:306)
		at org.junit.runners.ParentRunner.run(ParentRunner.java:413)
		at junit.framework.JUnit4TestAdapter.run(JUnit4TestAdapter.java:50)
		at org.apache.tools.ant.taskdefs.optional.junit.JUnitTestRunner.run(JUnitTestRunner.java:535)
		at org.apache.tools.ant.taskdefs.optional.junit.JUnitTestRunner.launch(JUnitTestRunner.java:1197)
		at org.apache.tools.ant.taskdefs.optional.junit.JUnitTestRunner.main(JUnitTestRunner.java:1042)
	Caused by: org.apache.catalina.LifecycleException: A child container failed during start
		at org.apache.catalina.core.ContainerBase.startInternal(ContainerBase.java:938)
		at org.apache.catalina.core.StandardHost.startInternal(StandardHost.java:886)
		at org.apache.catalina.util.LifecycleBase.start(LifecycleBase.java:183)
		at org.apache.catalina.core.ContainerBase$StartChild.call(ContainerBase.java:1396)
		at org.apache.catalina.core.ContainerBase$StartChild.call(ContainerBase.java:1386)
		at java.base/java.util.concurrent.FutureTask.run(FutureTask.java:264)
		at org.apache.tomcat.util.threads.InlineExecutorService.execute(InlineExecutorService.java:75)
		at java.base/java.util.concurrent.AbstractExecutorService.submit(AbstractExecutorService.java:140)
		at org.apache.catalina.core.ContainerBase.startInternal(ContainerBase.java:919)
		... 38 more
	Caused by: java.util.concurrent.ExecutionException: org.apache.catalina.LifecycleException: Deliberately Broken
		at java.base/java.util.concurrent.FutureTask.report(FutureTask.java:122)
		at java.base/java.util.concurrent.FutureTask.get(FutureTask.java:191)
		at org.apache.catalina.core.ContainerBase.startInternal(ContainerBase.java:926)
		... 46 more
	Caused by: org.apache.catalina.LifecycleException: Deliberately Broken
		at org.apache.catalina.startup.TestTomcat$BrokenAuthenticator.startInternal(TestTomcat.java:623)
		at org.apache.catalina.util.LifecycleBase.start(LifecycleBase.java:183)
		at org.apache.catalina.core.StandardPipeline.startInternal(StandardPipeline.java:176)
		at org.apache.catalina.util.LifecycleBase.start(LifecycleBase.java:183)
		at org.apache.catalina.core.StandardContext.startInternal(StandardContext.java:5096)
		at org.apache.catalina.util.LifecycleBase.start(LifecycleBase.java:183)
		at org.apache.catalina.core.ContainerBase$StartChild.call(ContainerBase.java:1396)
		at org.apache.catalina.core.ContainerBase$StartChild.call(ContainerBase.java:1386)
		at java.base/java.util.concurrent.FutureTask.run(FutureTask.java:264)
		at org.apache.tomcat.util.threads.InlineExecutorService.execute(InlineExecutorService.java:75)
		at java.base/java.util.concurrent.AbstractExecutorService.submit(AbstractExecutorService.java:140)
		at org.apache.catalina.core.ContainerBase.startInternal(ContainerBase.java:919)
		... 46 more
26-Jun-2022 02:59:02.409 INFO [main] org.apache.coyote.AbstractProtocol.pause Pausing ProtocolHandler ["http-nio2-127.0.0.1-auto-9-34231"]
26-Jun-2022 02:59:02.409 INFO [main] org.apache.catalina.core.StandardService.stopInternal Stopping service [Tomcat]
26-Jun-2022 02:59:02.409 INFO [main] org.apache.coyote.AbstractProtocol.destroy Destroying ProtocolHandler ["http-nio2-127.0.0.1-auto-9-34231"]
26-Jun-2022 02:59:07.808 WARNING [main] org.apache.tomcat.util.net.Nio2Endpoint.shutdownExecutor The executor associated with thread pool [http-nio2-127.0.0.1-auto-9] has not fully shutdown. Some application threads may still be running.
26-Jun-2022 02:59:07.812 INFO [main] org.apache.catalina.startup.LoggingBaseTest.setUp Starting test case [testBrokenWarTwo]
26-Jun-2022 02:59:07.813 INFO [main] org.apache.coyote.AbstractProtocol.init Initializing ProtocolHandler ["http-nio2-127.0.0.1-auto-10"]
26-Jun-2022 02:59:07.815 INFO [main] org.apache.catalina.core.StandardService.startInternal Starting service [Tomcat]
26-Jun-2022 02:59:07.815 INFO [main] org.apache.catalina.core.StandardEngine.startInternal Starting Servlet engine: [Apache Tomcat/10.0.23-dev]
26-Jun-2022 02:59:07.818 SEVERE [main] org.apache.catalina.core.ContainerBase.startInternal A child container failed during start
	java.util.concurrent.ExecutionException: org.apache.catalina.LifecycleException: Deliberately Broken
		at java.base/java.util.concurrent.FutureTask.report(FutureTask.java:122)
		at java.base/java.util.concurrent.FutureTask.get(FutureTask.java:191)
		at org.apache.catalina.core.ContainerBase.startInternal(ContainerBase.java:926)

Continuation...

		at org.apache.catalina.core.StandardHost.startInternal(StandardHost.java:886)
		at org.apache.catalina.util.LifecycleBase.start(LifecycleBase.java:183)
		at org.apache.catalina.core.ContainerBase$StartChild.call(ContainerBase.java:1396)
		at org.apache.catalina.core.ContainerBase$StartChild.call(ContainerBase.java:1386)
		at java.base/java.util.concurrent.FutureTask.run(FutureTask.java:264)
		at org.apache.tomcat.util.threads.InlineExecutorService.execute(InlineExecutorService.java:75)
		at java.base/java.util.concurrent.AbstractExecutorService.submit(AbstractExecutorService.java:140)
		at org.apache.catalina.core.ContainerBase.startInternal(ContainerBase.java:919)
		at org.apache.catalina.core.StandardEngine.startInternal(StandardEngine.java:265)
		at org.apache.catalina.util.LifecycleBase.start(LifecycleBase.java:183)
		at org.apache.catalina.core.StandardService.startInternal(StandardService.java:432)
		at org.apache.catalina.util.LifecycleBase.start(LifecycleBase.java:183)
		at org.apache.catalina.core.StandardServer.startInternal(StandardServer.java:930)
		at org.apache.catalina.util.LifecycleBase.start(LifecycleBase.java:183)
		at org.apache.catalina.startup.Tomcat.start(Tomcat.java:486)
		at org.apache.catalina.startup.TomcatBaseTest$TomcatWithFastSessionIDs.start(TomcatBaseTest.java:879)
		at org.apache.catalina.startup.TestTomcat.testBrokenWarTwo(TestTomcat.java:593)
		at java.base/jdk.internal.reflect.NativeMethodAccessorImpl.invoke0(Native Method)
		at java.base/jdk.internal.reflect.NativeMethodAccessorImpl.invoke(NativeMethodAccessorImpl.java:62)
		at java.base/jdk.internal.reflect.DelegatingMethodAccessorImpl.invoke(DelegatingMethodAccessorImpl.java:43)
		at java.base/java.lang.reflect.Method.invoke(Method.java:566)
		at org.junit.runners.model.FrameworkMethod$1.runReflectiveCall(FrameworkMethod.java:59)
		at org.junit.internal.runners.model.ReflectiveCallable.run(ReflectiveCallable.java:12)
		at org.junit.runners.model.FrameworkMethod.invokeExplosively(FrameworkMethod.java:61)
		at org.junit.internal.runners.statements.InvokeMethod.evaluate(InvokeMethod.java:17)
		at org.junit.internal.runners.statements.RunBefores.evaluate(RunBefores.java:26)
		at org.junit.internal.runners.statements.RunAfters.evaluate(RunAfters.java:27)
		at org.junit.rules.TestWatcher$1.evaluate(TestWatcher.java:61)
		at org.junit.runners.ParentRunner$3.evaluate(ParentRunner.java:306)
		at org.junit.runners.BlockJUnit4ClassRunner$1.evaluate(BlockJUnit4ClassRunner.java:100)
		at org.junit.runners.ParentRunner.runLeaf(ParentRunner.java:366)
		at org.junit.runners.BlockJUnit4ClassRunner.runChild(BlockJUnit4ClassRunner.java:103)
		at org.junit.runners.BlockJUnit4ClassRunner.runChild(BlockJUnit4ClassRunner.java:63)
		at org.junit.runners.ParentRunner$4.run(ParentRunner.java:331)
		at org.junit.runners.ParentRunner$1.schedule(ParentRunner.java:79)
		at org.junit.runners.ParentRunner.runChildren(ParentRunner.java:329)
		at org.junit.runners.ParentRunner.access$100(ParentRunner.java:66)
		at org.junit.runners.ParentRunner$2.evaluate(ParentRunner.java:293)
		at org.junit.internal.runners.statements.RunBefores.evaluate(RunBefores.java:26)
		at org.junit.internal.runners.statements.RunAfters.evaluate(RunAfters.java:27)
		at org.junit.runners.ParentRunner$3.evaluate(ParentRunner.java:306)
		at org.junit.runners.ParentRunner.run(ParentRunner.java:413)
		at junit.framework.JUnit4TestAdapter.run(JUnit4TestAdapter.java:50)
		at org.apache.tools.ant.taskdefs.optional.junit.JUnitTestRunner.run(JUnitTestRunner.java:535)
		at org.apache.tools.ant.taskdefs.optional.junit.JUnitTestRunner.launch(JUnitTestRunner.java:1197)
		at org.apache.tools.ant.taskdefs.optional.junit.JUnitTestRunner.main(JUnitTestRunner.java:1042)
	Caused by: org.apache.catalina.LifecycleException: Deliberately Broken
		at org.apache.catalina.startup.TestTomcat$BrokenAuthenticator.startInternal(TestTomcat.java:623)
		at org.apache.catalina.util.LifecycleBase.start(LifecycleBase.java:183)
		at org.apache.catalina.core.StandardPipeline.startInternal(StandardPipeline.java:176)
		at org.apache.catalina.util.LifecycleBase.start(LifecycleBase.java:183)
		at org.apache.catalina.core.StandardContext.startInternal(StandardContext.java:5096)
		at org.apache.catalina.util.LifecycleBase.start(LifecycleBase.java:183)
		at org.apache.catalina.core.ContainerBase$StartChild.call(ContainerBase.java:1396)
		at org.apache.catalina.core.ContainerBase$StartChild.call(ContainerBase.java:1386)
		at java.base/java.util.concurrent.FutureTask.run(FutureTask.java:264)
		at org.apache.tomcat.util.threads.InlineExecutorService.execute(InlineExecutorService.java:75)
		at java.base/java.util.concurrent.AbstractExecutorService.submit(AbstractExecutorService.java:140)
		at org.apache.catalina.core.ContainerBase.startInternal(ContainerBase.java:919)
		... 46 more
26-Jun-2022 02:59:07.819 SEVERE [main] org.apache.catalina.core.ContainerBase.startInternal A child container failed during start
	java.util.concurrent.ExecutionException: org.apache.catalina.LifecycleException: Deliberately Broken
		at java.base/java.util.concurrent.FutureTask.report(FutureTask.java:122)
		at java.base/java.util.concurrent.FutureTask.get(FutureTask.java:191)
		at org.apache.catalina.core.ContainerBase.startInternal(ContainerBase.java:926)
		at org.apache.catalina.core.StandardHost.startInternal(StandardHost.java:886)
		at org.apache.catalina.util.LifecycleBase.start(LifecycleBase.java:183)
		at org.apache.catalina.core.ContainerBase$StartChild.call(ContainerBase.java:1396)
		at org.apache.catalina.core.ContainerBase$StartChild.call(ContainerBase.java:1386)
		at java.base/java.util.concurrent.FutureTask.run(FutureTask.java:264)
		at org.apache.tomcat.util.threads.InlineExecutorService.execute(InlineExecutorService.java:75)
		at java.base/java.util.concurrent.AbstractExecutorService.submit(AbstractExecutorService.java:140)
		at org.apache.catalina.core.ContainerBase.startInternal(ContainerBase.java:919)
		at org.apache.catalina.core.StandardEngine.startInternal(StandardEngine.java:265)
		at org.apache.catalina.util.LifecycleBase.start(LifecycleBase.java:183)
		at org.apache.catalina.core.StandardService.startInternal(StandardService.java:432)
		at org.apache.catalina.util.LifecycleBase.start(LifecycleBase.java:183)
		at org.apache.catalina.core.StandardServer.startInternal(StandardServer.java:930)
		at org.apache.catalina.util.LifecycleBase.start(LifecycleBase.java:183)
		at org.apache.catalina.startup.Tomcat.start(Tomcat.java:486)
		at org.apache.catalina.startup.TomcatBaseTest$TomcatWithFastSessionIDs.start(TomcatBaseTest.java:879)
		at org.apache.catalina.startup.TestTomcat.testBrokenWarTwo(TestTomcat.java:593)
		at java.base/jdk.internal.reflect.NativeMethodAccessorImpl.invoke0(Native Method)
		at java.base/jdk.internal.reflect.NativeMethodAccessorImpl.invoke(NativeMethodAccessorImpl.java:62)
		at java.base/jdk.internal.reflect.DelegatingMethodAccessorImpl.invoke(DelegatingMethodAccessorImpl.java:43)
		at java.base/java.lang.reflect.Method.invoke(Method.java:566)
		at org.junit.runners.model.FrameworkMethod$1.runReflectiveCall(FrameworkMethod.java:59)
		at org.junit.internal.runners.model.ReflectiveCallable.run(ReflectiveCallable.java:12)
		at org.junit.runners.model.FrameworkMethod.invokeExplosively(FrameworkMethod.java:61)
		at org.junit.internal.runners.statements.InvokeMethod.evaluate(InvokeMethod.java:17)
		at org.junit.internal.runners.statements.RunBefores.evaluate(RunBefores.java:26)
		at org.junit.internal.runners.statements.RunAfters.evaluate(RunAfters.java:27)
		at org.junit.rules.TestWatcher$1.evaluate(TestWatcher.java:61)
		at org.junit.runners.ParentRunner$3.evaluate(ParentRunner.java:306)
		at org.junit.runners.BlockJUnit4ClassRunner$1.evaluate(BlockJUnit4ClassRunner.java:100)
		at org.junit.runners.ParentRunner.runLeaf(ParentRunner.java:366)
		at org.junit.runners.BlockJUnit4ClassRunner.runChild(BlockJUnit4ClassRunner.java:103)
		at org.junit.runners.BlockJUnit4ClassRunner.runChild(BlockJUnit4ClassRunner.java:63)
		at org.junit.runners.ParentRunner$4.run(ParentRunner.java:331)
		at org.junit.runners.ParentRunner$1.schedule(ParentRunner.java:79)
		at org.junit.runners.ParentRunner.runChildren(ParentRunner.java:329)
		at org.junit.runners.ParentRunner.access$100(ParentRunner.java:66)
		at org.junit.runners.ParentRunner$2.evaluate(ParentRunner.java:293)
		at org.junit.internal.runners.statements.RunBefores.evaluate(RunBefores.java:26)
		at org.junit.internal.runners.statements.RunAfters.evaluate(RunAfters.java:27)
		at org.junit.runners.ParentRunner$3.evaluate(ParentRunner.java:306)
		at org.junit.runners.ParentRunner.run(ParentRunner.java:413)
		at junit.framework.JUnit4TestAdapter.run(JUnit4TestAdapter.java:50)
		at org.apache.tools.ant.taskdefs.optional.junit.JUnitTestRunner.run(JUnitTestRunner.java:535)
		at org.apache.tools.ant.taskdefs.optional.junit.JUnitTestRunner.launch(JUnitTestRunner.java:1197)
		at org.apache.tools.ant.taskdefs.optional.junit.JUnitTestRunner.main(JUnitTestRunner.java:1042)
	Caused by: org.apache.catalina.LifecycleException: Deliberately Broken
		at org.apache.catalina.startup.TestTomcat$BrokenAuthenticator.startInternal(TestTomcat.java:623)
		at org.apache.catalina.util.LifecycleBase.start(LifecycleBase.java:183)
		at org.apache.catalina.core.StandardPipeline.startInternal(StandardPipeline.java:176)
		at org.apache.catalina.util.LifecycleBase.start(LifecycleBase.java:183)
		at org.apache.catalina.core.StandardContext.startInternal(StandardContext.java:5096)
		at org.apache.catalina.util.LifecycleBase.start(LifecycleBase.java:183)
		at org.apache.catalina.core.ContainerBase$StartChild.call(ContainerBase.java:1396)
		at org.apache.catalina.core.ContainerBase$StartChild.call(ContainerBase.java:1386)
		at java.base/java.util.concurrent.FutureTask.run(FutureTask.java:264)
		at org.apache.tomcat.util.threads.InlineExecutorService.execute(InlineExecutorService.java:75)
		at java.base/java.util.concurrent.AbstractExecutorService.submit(AbstractExecutorService.java:140)
		at org.apache.catalina.core.ContainerBase.startInternal(ContainerBase.java:919)
		... 46 more
26-Jun-2022 02:59:07.819 SEVERE [main] org.apache.catalina.core.ContainerBase.startInternal A child container failed during start
	java.util.concurrent.ExecutionException: org.apache.catalina.LifecycleException: A child container failed during start
		at java.base/java.util.concurrent.FutureTask.report(FutureTask.java:122)
		at java.base/java.util.concurrent.FutureTask.get(FutureTask.java:191)
		at org.apache.catalina.core.ContainerBase.startInternal(ContainerBase.java:926)
		at org.apache.catalina.core.StandardEngine.startInternal(StandardEngine.java:265)
		at org.apache.catalina.util.LifecycleBase.start(LifecycleBase.java:183)
		at org.apache.catalina.core.StandardService.startInternal(StandardService.java:432)
		at org.apache.catalina.util.LifecycleBase.start(LifecycleBase.java:183)
		at org.apache.catalina.core.StandardServer.startInternal(StandardServer.java:930)
		at org.apache.catalina.util.LifecycleBase.start(LifecycleBase.java:183)
		at org.apache.catalina.startup.Tomcat.start(Tomcat.java:486)
		at org.apache.catalina.startup.TomcatBaseTest$TomcatWithFastSessionIDs.start(TomcatBaseTest.java:879)
		at org.apache.catalina.startup.TestTomcat.testBrokenWarTwo(TestTomcat.java:593)
		at java.base/jdk.internal.reflect.NativeMethodAccessorImpl.invoke0(Native Method)
		at java.base/jdk.internal.reflect.NativeMethodAccessorImpl.invoke(NativeMethodAccessorImpl.java:62)
		at java.base/jdk.internal.reflect.DelegatingMethodAccessorImpl.invoke(DelegatingMethodAccessorImpl.java:43)
		at java.base/java.lang.reflect.Method.invoke(Method.java:566)
		at org.junit.runners.model.FrameworkMethod$1.runReflectiveCall(FrameworkMethod.java:59)
		at org.junit.internal.runners.model.ReflectiveCallable.run(ReflectiveCallable.java:12)
		at org.junit.runners.model.FrameworkMethod.invokeExplosively(FrameworkMethod.java:61)
		at org.junit.internal.runners.statements.InvokeMethod.evaluate(InvokeMethod.java:17)
		at org.junit.internal.runners.statements.RunBefores.evaluate(RunBefores.java:26)
		at org.junit.internal.runners.statements.RunAfters.evaluate(RunAfters.java:27)
		at org.junit.rules.TestWatcher$1.evaluate(TestWatcher.java:61)
		at org.junit.runners.ParentRunner$3.evaluate(ParentRunner.java:306)
		at org.junit.runners.BlockJUnit4ClassRunner$1.evaluate(BlockJUnit4ClassRunner.java:100)
		at org.junit.runners.ParentRunner.runLeaf(ParentRunner.java:366)
		at org.junit.runners.BlockJUnit4ClassRunner.runChild(BlockJUnit4ClassRunner.java:103)
		at org.junit.runners.BlockJUnit4ClassRunner.runChild(BlockJUnit4ClassRunner.java:63)
		at org.junit.runners.ParentRunner$4.run(ParentRunner.java:331)
		at org.junit.runners.ParentRunner$1.schedule(ParentRunner.java:79)
		at org.junit.runners.ParentRunner.runChildren(ParentRunner.java:329)
		at org.junit.runners.ParentRunner.access$100(ParentRunner.java:66)
		at org.junit.runners.ParentRunner$2.evaluate(ParentRunner.java:293)
		at org.junit.internal.runners.statements.RunBefores.evaluate(RunBefores.java:26)
		at org.junit.internal.runners.statements.RunAfters.evaluate(RunAfters.java:27)
		at org.junit.runners.ParentRunner$3.evaluate(ParentRunner.java:306)
		at org.junit.runners.ParentRunner.run(ParentRunner.java:413)
		at junit.framework.JUnit4TestAdapter.run(JUnit4TestAdapter.java:50)
		at org.apache.tools.ant.taskdefs.optional.junit.JUnitTestRunner.run(JUnitTestRunner.java:535)
		at org.apache.tools.ant.taskdefs.optional.junit.JUnitTestRunner.launch(JUnitTestRunner.java:1197)
		at org.apache.tools.ant.taskdefs.optional.junit.JUnitTestRunner.main(JUnitTestRunner.java:1042)
	Caused by: org.apache.catalina.LifecycleException: A child container failed during start
		at org.apache.catalina.core.ContainerBase.startInternal(ContainerBase.java:938)
		at org.apache.catalina.core.StandardHost.startInternal(StandardHost.java:886)
		at org.apache.catalina.util.LifecycleBase.start(LifecycleBase.java:183)
		at org.apache.catalina.core.ContainerBase$StartChild.call(ContainerBase.java:1396)
		at org.apache.catalina.core.ContainerBase$StartChild.call(ContainerBase.java:1386)
		at java.base/java.util.concurrent.FutureTask.run(FutureTask.java:264)
		at org.apache.tomcat.util.threads.InlineExecutorService.execute(InlineExecutorService.java:75)
		at java.base/java.util.concurrent.AbstractExecutorService.submit(AbstractExecutorService.java:140)
		at org.apache.catalina.core.ContainerBase.startInternal(ContainerBase.java:919)
		... 38 more
	Caused by: org.apache.tomcat.util.MultiThrowable: 2 wrapped Throwables: [org.apache.catalina.LifecycleException: Deliberately Broken][org.apache.catalina.LifecycleException: Deliberately Broken]
		at org.apache.catalina.core.ContainerBase.startInternal(ContainerBase.java:930)
		... 46 more
26-Jun-2022 02:59:07.820 INFO [main] org.apache.coyote.AbstractProtocol.pause Pausing ProtocolHandler ["http-nio2-127.0.0.1-auto-10-39719"]
26-Jun-2022 02:59:07.820 INFO [main] org.apache.catalina.core.StandardService.stopInternal Stopping service [Tomcat]
26-Jun-2022 02:59:07.820 INFO [main] org.apache.coyote.AbstractProtocol.destroy Destroying ProtocolHandler ["http-nio2-127.0.0.1-auto-10-39719"]
26-Jun-2022 02:59:13.185 WARNING [main] org.apache.tomcat.util.net.Nio2Endpoint.shutdownExecutor The executor associated with thread pool [http-nio2-127.0.0.1-auto-10] has not fully shutdown. Some application threads may still be running.
26-Jun-2022 02:59:13.190 INFO [main] org.apache.catalina.startup.LoggingBaseTest.setUp Starting test case [testJsps]
26-Jun-2022 02:59:13.192 INFO [main] org.apache.coyote.AbstractProtocol.init Initializing ProtocolHandler ["http-nio2-127.0.0.1-auto-11"]
26-Jun-2022 02:59:13.194 INFO [main] org.apache.catalina.core.StandardService.startInternal Starting service [Tomcat]
26-Jun-2022 02:59:13.194 INFO [main] org.apache.catalina.core.StandardEngine.startInternal Starting Servlet engine: [Apache Tomcat/10.0.23-dev]
26-Jun-2022 02:59:13.203 INFO [main] org.apache.catalina.startup.ContextConfig.getDefaultWebXmlFragment No global web.xml found
26-Jun-2022 02:59:14.058 INFO [main] org.apache.jasper.servlet.TldScanner.scanJars At least one JAR was scanned for TLDs yet contained no TLDs. Enable debug logging for this logger for a complete list of JARs that were scanned but no TLDs were found in them. Skipping unneeded JARs during scanning can improve startup time and JSP compilation time.
26-Jun-2022 02:59:14.080 INFO [main] org.apache.catalina.core.ApplicationContext.log ContextListener: contextInitialized()
26-Jun-2022 02:59:14.081 INFO [main] org.apache.catalina.core.ApplicationContext.log SessionListener: contextInitialized()
26-Jun-2022 02:59:14.081 INFO [main] org.apache.catalina.core.ApplicationContext.log ContextListener: attributeAdded('StockTicker', 'async.Stockticker@480b785a')
26-Jun-2022 02:59:14.087 INFO [main] org.apache.coyote.AbstractProtocol.start Starting ProtocolHandler ["http-nio2-127.0.0.1-auto-11-39053"]
26-Jun-2022 02:59:14.188 INFO [http-nio2-127.0.0.1-auto-11-exec-2] org.apache.catalina.core.ApplicationContext.log ContextListener: attributeAdded('org.apache.jasper.runtime.JspApplicationContextImpl', 'org.apache.jasper.runtime.JspApplicationContextImpl@55ad261')
26-Jun-2022 02:59:14.219 INFO [http-nio2-127.0.0.1-auto-11-exec-2] org.apache.catalina.core.ApplicationContext.log ContextListener: attributeAdded('org.apache.jasper.compiler.ELInterpreter', 'org.apache.jasper.compiler.ELInterpreterFactory$DefaultELInterpreter@7d6040f5')
26-Jun-2022 02:59:14.219 INFO [http-nio2-127.0.0.1-auto-11-exec-2] org.apache.catalina.core.ApplicationContext.log ContextListener: attributeAdded('org.apache.jasper.compiler.StringInterpreter', 'org.apache.jasper.compiler.StringInterpreterFactory$DefaultStringInterpreter@6f0efbd8')
26-Jun-2022 02:59:14.730 INFO [http-nio2-127.0.0.1-auto-11-exec-2] org.apache.catalina.core.ApplicationContext.log SessionListener: sessionCreated('779D29F3F694255586183CF66F65D6F6')
26-Jun-2022 02:59:14.739 INFO [main] org.apache.coyote.AbstractProtocol.pause Pausing ProtocolHandler ["http-nio2-127.0.0.1-auto-11-39053"]
26-Jun-2022 02:59:14.740 INFO [main] org.apache.catalina.core.StandardService.stopInternal Stopping service [Tomcat]
26-Jun-2022 02:59:14.741 INFO [main] org.apache.catalina.core.ApplicationContext.log SessionListener: sessionDestroyed('779D29F3F694255586183CF66F65D6F6')
26-Jun-2022 02:59:14.741 INFO [main] org.apache.catalina.core.ApplicationContext.log SessionListener: contextDestroyed()
26-Jun-2022 02:59:14.741 INFO [main] org.apache.catalina.core.ApplicationContext.log ContextListener: contextDestroyed()
26-Jun-2022 02:59:14.743 INFO [main] org.apache.coyote.AbstractProtocol.stop Stopping ProtocolHandler ["http-nio2-127.0.0.1-auto-11-39053"]
26-Jun-2022 02:59:14.746 INFO [main] org.apache.coyote.AbstractProtocol.destroy Destroying ProtocolHandler ["http-nio2-127.0.0.1-auto-11-39053"]
26-Jun-2022 02:59:14.748 INFO [main] org.apache.catalina.startup.LoggingBaseTest.setUp Starting test case [testGetWebappConfigFileFromDirectory]
26-Jun-2022 02:59:14.749 INFO [main] org.apache.coyote.AbstractProtocol.destroy Destroying ProtocolHandler ["http-nio2-127.0.0.1-auto-12"]
26-Jun-2022 02:59:14.749 INFO [main] org.apache.catalina.startup.LoggingBaseTest.setUp Starting test case [testBug50826]
26-Jun-2022 02:59:14.750 INFO [main] org.apache.coyote.AbstractProtocol.destroy Destroying ProtocolHandler ["http-nio2-127.0.0.1-auto-13"]
26-Jun-2022 02:59:14.750 INFO [main] org.apache.catalina.startup.LoggingBaseTest.setUp Starting test case [testBug51526]
26-Jun-2022 02:59:14.752 INFO [main] org.apache.coyote.AbstractProtocol.init Initializing ProtocolHandler ["http-nio2-127.0.0.1-auto-14"]
26-Jun-2022 02:59:14.765 INFO [main] org.apache.catalina.core.StandardService.startInternal Starting service [Tomcat]

Continuation...

26-Jun-2022 02:59:14.765 INFO [main] org.apache.catalina.core.StandardEngine.startInternal Starting Servlet engine: [Apache Tomcat/10.0.23-dev]
26-Jun-2022 02:59:14.773 INFO [main] org.apache.catalina.startup.ContextConfig.getDefaultWebXmlFragment No global web.xml found
26-Jun-2022 02:59:15.489 INFO [main] org.apache.jasper.servlet.TldScanner.scanJars At least one JAR was scanned for TLDs yet contained no TLDs. Enable debug logging for this logger for a complete list of JARs that were scanned but no TLDs were found in them. Skipping unneeded JARs during scanning can improve startup time and JSP compilation time.
26-Jun-2022 02:59:15.494 INFO [main] org.apache.coyote.AbstractProtocol.start Starting ProtocolHandler ["http-nio2-127.0.0.1-auto-14-35915"]
26-Jun-2022 02:59:15.495 INFO [main] org.apache.coyote.AbstractProtocol.pause Pausing ProtocolHandler ["http-nio2-127.0.0.1-auto-14-35915"]
26-Jun-2022 02:59:15.495 INFO [main] org.apache.catalina.core.StandardService.stopInternal Stopping service [Tomcat]
26-Jun-2022 02:59:15.497 INFO [main] org.apache.coyote.AbstractProtocol.stop Stopping ProtocolHandler ["http-nio2-127.0.0.1-auto-14-35915"]
26-Jun-2022 02:59:15.498 INFO [main] org.apache.coyote.AbstractProtocol.destroy Destroying ProtocolHandler ["http-nio2-127.0.0.1-auto-14-35915"]
26-Jun-2022 02:59:15.500 INFO [main] org.apache.catalina.startup.LoggingBaseTest.setUp Starting test case [testBug53301]
26-Jun-2022 02:59:15.501 INFO [main] org.apache.coyote.AbstractProtocol.init Initializing ProtocolHandler ["http-nio2-127.0.0.1-auto-15"]
26-Jun-2022 02:59:15.508 INFO [main] org.apache.catalina.core.StandardService.startInternal Starting service [Tomcat]
26-Jun-2022 02:59:15.508 INFO [main] org.apache.catalina.core.StandardEngine.startInternal Starting Servlet engine: [Apache Tomcat/10.0.23-dev]
26-Jun-2022 02:59:15.512 INFO [main] org.apache.coyote.AbstractProtocol.start Starting ProtocolHandler ["http-nio2-127.0.0.1-auto-15-39035"]
26-Jun-2022 02:59:15.517 INFO [main] org.apache.coyote.AbstractProtocol.pause Pausing ProtocolHandler ["http-nio2-127.0.0.1-auto-15-39035"]
26-Jun-2022 02:59:15.520 INFO [main] org.apache.catalina.core.StandardService.stopInternal Stopping service [Tomcat]
26-Jun-2022 02:59:15.528 INFO [main] org.apache.coyote.AbstractProtocol.stop Stopping ProtocolHandler ["http-nio2-127.0.0.1-auto-15-39035"]
26-Jun-2022 02:59:15.528 INFO [main] org.apache.coyote.AbstractProtocol.destroy Destroying ProtocolHandler ["http-nio2-127.0.0.1-auto-15-39035"]
26-Jun-2022 02:59:15.531 INFO [main] org.apache.catalina.startup.LoggingBaseTest.setUp Starting test case [testEnableNaming]
26-Jun-2022 02:59:15.538 INFO [main] org.apache.coyote.AbstractProtocol.init Initializing ProtocolHandler ["http-nio2-127.0.0.1-auto-16"]
26-Jun-2022 02:59:15.552 INFO [main] org.apache.catalina.core.StandardService.startInternal Starting service [Tomcat]
26-Jun-2022 02:59:15.552 INFO [main] org.apache.catalina.core.StandardEngine.startInternal Starting Servlet engine: [Apache Tomcat/10.0.23-dev]
26-Jun-2022 02:59:15.558 INFO [main] org.apache.coyote.AbstractProtocol.start Starting ProtocolHandler ["http-nio2-127.0.0.1-auto-16-38981"]
26-Jun-2022 02:59:15.585 INFO [main] org.apache.coyote.AbstractProtocol.pause Pausing ProtocolHandler ["http-nio2-127.0.0.1-auto-16-38981"]
26-Jun-2022 02:59:15.587 INFO [main] org.apache.catalina.core.StandardService.stopInternal Stopping service [Tomcat]
26-Jun-2022 02:59:15.589 INFO [main] org.apache.coyote.AbstractProtocol.stop Stopping ProtocolHandler ["http-nio2-127.0.0.1-auto-16-38981"]
26-Jun-2022 02:59:15.589 INFO [main] org.apache.coyote.AbstractProtocol.destroy Destroying ProtocolHandler ["http-nio2-127.0.0.1-auto-16-38981"]
26-Jun-2022 02:59:15.593 INFO [main] org.apache.catalina.startup.LoggingBaseTest.setUp Starting test case [testLaunchTime]
26-Jun-2022 02:59:15.595 INFO [main] org.apache.coyote.AbstractProtocol.init Initializing ProtocolHandler ["http-nio2-127.0.0.1-auto-17"]
26-Jun-2022 02:59:15.604 INFO [main] org.apache.catalina.core.StandardService.startInternal Starting service [Tomcat]
26-Jun-2022 02:59:15.604 INFO [main] org.apache.catalina.core.StandardEngine.startInternal Starting Servlet engine: [Apache Tomcat/10.0.23-dev]
26-Jun-2022 02:59:15.608 INFO [main] org.apache.coyote.AbstractProtocol.start Starting ProtocolHandler ["http-nio2-127.0.0.1-auto-17-46531"]
26-Jun-2022 02:59:15.608 INFO [main] org.apache.catalina.startup.TestTomcat.testLaunchTime Tomcat started in [14] ms
26-Jun-2022 02:59:15.608 INFO [main] org.apache.coyote.AbstractProtocol.pause Pausing ProtocolHandler ["http-nio2-127.0.0.1-auto-17-46531"]
26-Jun-2022 02:59:15.611 INFO [main] org.apache.catalina.core.StandardService.stopInternal Stopping service [Tomcat]
26-Jun-2022 02:59:15.612 INFO [main] org.apache.coyote.AbstractProtocol.stop Stopping ProtocolHandler ["http-nio2-127.0.0.1-auto-17-46531"]
26-Jun-2022 02:59:15.613 INFO [main] org.apache.coyote.AbstractProtocol.destroy Destroying ProtocolHandler ["http-nio2-127.0.0.1-auto-17-46531"]
26-Jun-2022 02:59:15.614 INFO [main] org.apache.catalina.startup.LoggingBaseTest.setUp Starting test case [testAddWebappUrl]
26-Jun-2022 02:59:15.616 INFO [main] org.apache.coyote.AbstractProtocol.init Initializing ProtocolHandler ["http-nio2-127.0.0.1-auto-18"]
26-Jun-2022 02:59:15.628 INFO [main] org.apache.catalina.core.StandardService.startInternal Starting service [Tomcat]
26-Jun-2022 02:59:15.628 INFO [main] org.apache.catalina.core.StandardEngine.startInternal Starting Servlet engine: [Apache Tomcat/10.0.23-dev]
26-Jun-2022 02:59:15.642 INFO [main] org.apache.catalina.startup.ContextConfig.getDefaultWebXmlFragment No global web.xml found
26-Jun-2022 02:59:16.311 INFO [main] org.apache.jasper.servlet.TldScanner.scanJars At least one JAR was scanned for TLDs yet contained no TLDs. Enable debug logging for this logger for a complete list of JARs that were scanned but no TLDs were found in them. Skipping unneeded JARs during scanning can improve startup time and JSP compilation time.
26-Jun-2022 02:59:16.318 INFO [main] org.apache.coyote.AbstractProtocol.start Starting ProtocolHandler ["http-nio2-127.0.0.1-auto-18-38617"]
26-Jun-2022 02:59:16.322 INFO [main] org.apache.coyote.AbstractProtocol.pause Pausing ProtocolHandler ["http-nio2-127.0.0.1-auto-18-38617"]
26-Jun-2022 02:59:16.323 INFO [main] org.apache.catalina.core.StandardService.stopInternal Stopping service [Tomcat]
26-Jun-2022 02:59:16.325 INFO [main] org.apache.coyote.AbstractProtocol.stop Stopping ProtocolHandler ["http-nio2-127.0.0.1-auto-18-38617"]
26-Jun-2022 02:59:16.325 INFO [main] org.apache.coyote.AbstractProtocol.destroy Destroying ProtocolHandler ["http-nio2-127.0.0.1-auto-18-38617"]
26-Jun-2022 02:59:16.329 INFO [main] org.apache.catalina.startup.LoggingBaseTest.setUp Starting test case [testEnableNamingGlobal]
26-Jun-2022 02:59:16.333 INFO [main] org.apache.coyote.AbstractProtocol.init Initializing ProtocolHandler ["http-nio2-127.0.0.1-auto-19"]
26-Jun-2022 02:59:16.342 INFO [main] org.apache.catalina.core.StandardService.startInternal Starting service [Tomcat]
26-Jun-2022 02:59:16.342 INFO [main] org.apache.catalina.core.StandardEngine.startInternal Starting Servlet engine: [Apache Tomcat/10.0.23-dev]
26-Jun-2022 02:59:16.346 INFO [main] org.apache.coyote.AbstractProtocol.start Starting ProtocolHandler ["http-nio2-127.0.0.1-auto-19-44697"]
26-Jun-2022 02:59:16.353 INFO [main] org.apache.coyote.AbstractProtocol.pause Pausing ProtocolHandler ["http-nio2-127.0.0.1-auto-19-44697"]
26-Jun-2022 02:59:16.354 INFO [main] org.apache.catalina.core.StandardService.stopInternal Stopping service [Tomcat]
26-Jun-2022 02:59:16.355 INFO [main] org.apache.coyote.AbstractProtocol.stop Stopping ProtocolHandler ["http-nio2-127.0.0.1-auto-19-44697"]
26-Jun-2022 02:59:16.356 INFO [main] org.apache.coyote.AbstractProtocol.destroy Destroying ProtocolHandler ["http-nio2-127.0.0.1-auto-19-44697"]
26-Jun-2022 02:59:16.358 INFO [main] org.apache.catalina.startup.LoggingBaseTest.setUp Starting test case [testGetBrokenContextPerAddWepapp]
26-Jun-2022 02:59:16.359 INFO [main] org.apache.coyote.AbstractProtocol.destroy Destroying ProtocolHandler ["http-nio2-127.0.0.1-auto-20"]
26-Jun-2022 02:59:16.359 INFO [main] org.apache.catalina.startup.LoggingBaseTest.setUp Starting test case [testGetResource]
26-Jun-2022 02:59:16.360 INFO [main] org.apache.coyote.AbstractProtocol.init Initializing ProtocolHandler ["http-nio2-127.0.0.1-auto-21"]
26-Jun-2022 02:59:16.367 INFO [main] org.apache.catalina.core.StandardService.startInternal Starting service [Tomcat]
26-Jun-2022 02:59:16.367 INFO [main] org.apache.catalina.core.StandardEngine.startInternal Starting Servlet engine: [Apache Tomcat/10.0.23-dev]
26-Jun-2022 02:59:16.374 INFO [main] org.apache.catalina.startup.ContextConfig.getDefaultWebXmlFragment No global web.xml found
26-Jun-2022 02:59:17.055 INFO [main] org.apache.jasper.servlet.TldScanner.scanJars At least one JAR was scanned for TLDs yet contained no TLDs. Enable debug logging for this logger for a complete list of JARs that were scanned but no TLDs were found in them. Skipping unneeded JARs during scanning can improve startup time and JSP compilation time.
26-Jun-2022 02:59:17.062 INFO [main] org.apache.catalina.core.ApplicationContext.log ContextListener: contextInitialized()
26-Jun-2022 02:59:17.062 INFO [main] org.apache.catalina.core.ApplicationContext.log SessionListener: contextInitialized()
26-Jun-2022 02:59:17.063 INFO [main] org.apache.catalina.core.ApplicationContext.log ContextListener: attributeAdded('StockTicker', 'async.Stockticker@70077a14')
26-Jun-2022 02:59:17.075 INFO [main] org.apache.coyote.AbstractProtocol.start Starting ProtocolHandler ["http-nio2-127.0.0.1-auto-21-35731"]
26-Jun-2022 02:59:17.079 INFO [main] org.apache.coyote.AbstractProtocol.pause Pausing ProtocolHandler ["http-nio2-127.0.0.1-auto-21-35731"]
26-Jun-2022 02:59:17.083 INFO [main] org.apache.catalina.core.StandardService.stopInternal Stopping service [Tomcat]
26-Jun-2022 02:59:17.084 INFO [main] org.apache.catalina.core.ApplicationContext.log SessionListener: contextDestroyed()
26-Jun-2022 02:59:17.084 INFO [main] org.apache.catalina.core.ApplicationContext.log ContextListener: contextDestroyed()
26-Jun-2022 02:59:17.085 INFO [main] org.apache.coyote.AbstractProtocol.stop Stopping ProtocolHandler ["http-nio2-127.0.0.1-auto-21-35731"]
26-Jun-2022 02:59:17.085 INFO [main] org.apache.coyote.AbstractProtocol.destroy Destroying ProtocolHandler ["http-nio2-127.0.0.1-auto-21-35731"]
26-Jun-2022 02:59:17.089 INFO [main] org.apache.catalina.startup.LoggingBaseTest.setUp Starting test case [testGetCustomContextPerAddContextWithHost]
26-Jun-2022 02:59:17.090 INFO [main] org.apache.coyote.AbstractProtocol.destroy Destroying ProtocolHandler ["http-nio2-127.0.0.1-auto-22"]
26-Jun-2022 02:59:17.090 INFO [main] org.apache.catalina.startup.LoggingBaseTest.setUp Starting test case [testGetBrokenContextPerAddContext]
26-Jun-2022 02:59:17.091 INFO [main] org.apache.coyote.AbstractProtocol.destroy Destroying ProtocolHandler ["http-nio2-127.0.0.1-auto-23"]
26-Jun-2022 02:59:17.091 INFO [main] org.apache.catalina.startup.LoggingBaseTest.setUp Starting test case [testGetDefaultContextPerAddContext]
26-Jun-2022 02:59:17.092 INFO [main] org.apache.coyote.AbstractProtocol.destroy Destroying ProtocolHandler ["http-nio2-127.0.0.1-auto-24"]
26-Jun-2022 02:59:17.092 INFO [main] org.apache.catalina.startup.LoggingBaseTest.setUp Starting test case [testSession]
26-Jun-2022 02:59:17.093 INFO [main] org.apache.coyote.AbstractProtocol.init Initializing ProtocolHandler ["http-nio2-127.0.0.1-auto-25"]
26-Jun-2022 02:59:17.101 INFO [main] org.apache.catalina.core.StandardService.startInternal Starting service [Tomcat]
26-Jun-2022 02:59:17.101 INFO [main] org.apache.catalina.core.StandardEngine.startInternal Starting Servlet engine: [Apache Tomcat/10.0.23-dev]
26-Jun-2022 02:59:17.108 INFO [main] org.apache.coyote.AbstractProtocol.start Starting ProtocolHandler ["http-nio2-127.0.0.1-auto-25-44741"]
26-Jun-2022 02:59:17.111 INFO [main] org.apache.coyote.AbstractProtocol.pause Pausing ProtocolHandler ["http-nio2-127.0.0.1-auto-25-44741"]
26-Jun-2022 02:59:17.114 INFO [main] org.apache.catalina.core.StandardService.stopInternal Stopping service [Tomcat]
26-Jun-2022 02:59:17.115 INFO [main] org.apache.coyote.AbstractProtocol.stop Stopping ProtocolHandler ["http-nio2-127.0.0.1-auto-25-44741"]
26-Jun-2022 02:59:17.115 INFO [main] org.apache.coyote.AbstractProtocol.destroy Destroying ProtocolHandler ["http-nio2-127.0.0.1-auto-25-44741"]
26-Jun-2022 02:59:17.118 INFO [main] org.apache.catalina.startup.LoggingBaseTest.setUp Starting test case [testGetCustomContextPerAddWebappWithNullHost]
26-Jun-2022 02:59:17.119 INFO [main] org.apache.coyote.AbstractProtocol.destroy Destroying ProtocolHandler ["http-nio2-127.0.0.1-auto-26"]
------------- ---------------- ---------------

Testcase: testProgrammatic took 1.457 sec
Testcase: testGetDefaultContextPerAddWebapp took 0.008 sec
Testcase: testGetCustomContextPerAddWebappWithHost took 0.004 sec
Testcase: testGetWebappConfigFileFromJarNegative took 0.001 sec
Testcase: testGetWebappConfigFileFromJar took 0.002 sec
Testcase: testGetWebappConfigFileFromDirectoryNegative took 0.001 sec
Testcase: testCustomContextConfig took 0.032 sec
Testcase: testSingleWebapp took 1.675 sec
Testcase: testBrokenWarOne took 5.427 sec
Testcase: testBrokenWarTwo took 5.378 sec
Testcase: testJsps took 1.558 sec
Testcase: testGetWebappConfigFileFromDirectory took 0.001 sec
Testcase: testBug50826 took 0.001 sec
Testcase: testBug51526 took 0.75 sec
Testcase: testBug53301 took 0.03 sec
Testcase: testEnableNaming took 0.062 sec
Testcase: testLaunchTime took 0.021 sec
Testcase: testAddWebappUrl took 0.715 sec
Testcase: testEnableNamingGlobal took 0.029 sec
Testcase: testGetBrokenContextPerAddWepapp took 0.001 sec
Testcase: testGetResource took 0.73 sec
Testcase: testGetCustomContextPerAddContextWithHost took 0.001 sec
Testcase: testGetBrokenContextPerAddContext took 0.001 sec
Testcase: testGetDefaultContextPerAddContext took 0.001 sec
Testcase: testSession took 0.025 sec
Testcase: testGetCustomContextPerAddWebappWithNullHost took 0.001 sec

Apache Gump, Gump, Apache, the Apache feather logo, and the Apache Gump project logos are trademarks of The Apache Software Foundation.

Last Updated: Sun, 26 Jun 2022 00:00:04 ().Python Logo