Run| Workspace| Log| Issues| Fixes| Pre-reqs| Stats| XRef| Maven Repository Proxy Log Gump Logo

Details

File Contents

Testsuite: org.apache.catalina.connector.TestResponse
Tests run: 77, Failures: 0, Errors: 0, Skipped: 0, Time elapsed: 0.953 sec
------------- Standard Error -----------------
25-Jun-2022 08:53:52.972 INFO [main] org.apache.catalina.startup.LoggingBaseTest.setUp Starting test case [testSendRedirect01]
25-Jun-2022 08:53:53.102 INFO [main] org.apache.coyote.AbstractProtocol.destroy Destroying ProtocolHandler ["http-nio2-127.0.0.1-auto-1"]
25-Jun-2022 08:53:53.106 INFO [main] org.apache.catalina.startup.LoggingBaseTest.setUp Starting test case [testSendRedirect02]
25-Jun-2022 08:53:53.107 INFO [main] org.apache.coyote.AbstractProtocol.destroy Destroying ProtocolHandler ["http-nio2-127.0.0.1-auto-2"]
25-Jun-2022 08:53:53.108 INFO [main] org.apache.catalina.startup.LoggingBaseTest.setUp Starting test case [testSendRedirect03]
25-Jun-2022 08:53:53.108 INFO [main] org.apache.coyote.AbstractProtocol.destroy Destroying ProtocolHandler ["http-nio2-127.0.0.1-auto-3"]
25-Jun-2022 08:53:53.109 INFO [main] org.apache.catalina.startup.LoggingBaseTest.setUp Starting test case [testSetLocale01]
25-Jun-2022 08:53:53.113 INFO [main] org.apache.coyote.AbstractProtocol.destroy Destroying ProtocolHandler ["http-nio2-127.0.0.1-auto-4"]
25-Jun-2022 08:53:53.113 INFO [main] org.apache.catalina.startup.LoggingBaseTest.setUp Starting test case [testSetLocale02]
25-Jun-2022 08:53:53.115 INFO [main] org.apache.coyote.AbstractProtocol.destroy Destroying ProtocolHandler ["http-nio2-127.0.0.1-auto-5"]
25-Jun-2022 08:53:53.115 INFO [main] org.apache.catalina.startup.LoggingBaseTest.setUp Starting test case [testSetLocale03]
25-Jun-2022 08:53:53.116 INFO [main] org.apache.coyote.AbstractProtocol.destroy Destroying ProtocolHandler ["http-nio2-127.0.0.1-auto-6"]
25-Jun-2022 08:53:53.117 INFO [main] org.apache.catalina.startup.LoggingBaseTest.setUp Starting test case [testSetLocale04]
25-Jun-2022 08:53:53.118 INFO [main] org.apache.coyote.AbstractProtocol.destroy Destroying ProtocolHandler ["http-nio2-127.0.0.1-auto-7"]
25-Jun-2022 08:53:53.118 INFO [main] org.apache.catalina.startup.LoggingBaseTest.setUp Starting test case [testSetLocale05]
25-Jun-2022 08:53:53.119 WARNING [main] org.apache.catalina.connector.Response.setLocale The encoding [unknown] is not recognised by the JRE
	java.io.UnsupportedEncodingException: The character encoding [unknown] is not supported
		at org.apache.tomcat.util.buf.B2CConverter.getCharset(B2CConverter.java:65)
		at org.apache.coyote.Response.setCharacterEncoding(Response.java:514)
		at org.apache.catalina.connector.Response.setLocale(Response.java:852)
		at org.apache.catalina.connector.TestResponse.testSetLocale05(TestResponse.java:893)
		at java.base/jdk.internal.reflect.NativeMethodAccessorImpl.invoke0(Native Method)
		at java.base/jdk.internal.reflect.NativeMethodAccessorImpl.invoke(NativeMethodAccessorImpl.java:62)
		at java.base/jdk.internal.reflect.DelegatingMethodAccessorImpl.invoke(DelegatingMethodAccessorImpl.java:43)
		at java.base/java.lang.reflect.Method.invoke(Method.java:566)
		at org.junit.runners.model.FrameworkMethod$1.runReflectiveCall(FrameworkMethod.java:59)
		at org.junit.internal.runners.model.ReflectiveCallable.run(ReflectiveCallable.java:12)
		at org.junit.runners.model.FrameworkMethod.invokeExplosively(FrameworkMethod.java:61)
		at org.junit.internal.runners.statements.InvokeMethod.evaluate(InvokeMethod.java:17)
		at org.junit.internal.runners.statements.ExpectException.evaluate(ExpectException.java:19)
		at org.junit.internal.runners.statements.RunBefores.evaluate(RunBefores.java:26)
		at org.junit.internal.runners.statements.RunAfters.evaluate(RunAfters.java:27)
		at org.junit.rules.TestWatcher$1.evaluate(TestWatcher.java:61)
		at org.junit.runners.ParentRunner$3.evaluate(ParentRunner.java:306)
		at org.junit.runners.BlockJUnit4ClassRunner$1.evaluate(BlockJUnit4ClassRunner.java:100)
		at org.junit.runners.ParentRunner.runLeaf(ParentRunner.java:366)
		at org.junit.runners.BlockJUnit4ClassRunner.runChild(BlockJUnit4ClassRunner.java:103)
		at org.junit.runners.BlockJUnit4ClassRunner.runChild(BlockJUnit4ClassRunner.java:63)
		at org.junit.runners.ParentRunner$4.run(ParentRunner.java:331)
		at org.junit.runners.ParentRunner$1.schedule(ParentRunner.java:79)
		at org.junit.runners.ParentRunner.runChildren(ParentRunner.java:329)
		at org.junit.runners.ParentRunner.access$100(ParentRunner.java:66)
		at org.junit.runners.ParentRunner$2.evaluate(ParentRunner.java:293)
		at org.junit.internal.runners.statements.RunBefores.evaluate(RunBefores.java:26)
		at org.junit.internal.runners.statements.RunAfters.evaluate(RunAfters.java:27)
		at org.junit.runners.ParentRunner$3.evaluate(ParentRunner.java:306)
		at org.junit.runners.ParentRunner.run(ParentRunner.java:413)
		at junit.framework.JUnit4TestAdapter.run(JUnit4TestAdapter.java:50)
		at org.apache.tools.ant.taskdefs.optional.junit.JUnitTestRunner.run(JUnitTestRunner.java:535)
		at org.apache.tools.ant.taskdefs.optional.junit.JUnitTestRunner.launch(JUnitTestRunner.java:1197)
		at org.apache.tools.ant.taskdefs.optional.junit.JUnitTestRunner.main(JUnitTestRunner.java:1042)
25-Jun-2022 08:53:53.120 WARNING [main] org.apache.catalina.connector.Response.setCharacterEncoding The encoding [unknown] is not recognised by the JRE
	java.io.UnsupportedEncodingException: The character encoding [unknown] is not supported
		at org.apache.tomcat.util.buf.B2CConverter.getCharset(B2CConverter.java:65)
		at org.apache.coyote.Response.setCharacterEncoding(Response.java:514)
		at org.apache.catalina.connector.Response.setCharacterEncoding(Response.java:795)
		at org.apache.catalina.connector.Response.getWriter(Response.java:575)
		at org.apache.catalina.connector.TestResponse.testSetLocale05(TestResponse.java:895)
		at java.base/jdk.internal.reflect.NativeMethodAccessorImpl.invoke0(Native Method)
		at java.base/jdk.internal.reflect.NativeMethodAccessorImpl.invoke(NativeMethodAccessorImpl.java:62)
		at java.base/jdk.internal.reflect.DelegatingMethodAccessorImpl.invoke(DelegatingMethodAccessorImpl.java:43)
		at java.base/java.lang.reflect.Method.invoke(Method.java:566)
		at org.junit.runners.model.FrameworkMethod$1.runReflectiveCall(FrameworkMethod.java:59)
		at org.junit.internal.runners.model.ReflectiveCallable.run(ReflectiveCallable.java:12)
		at org.junit.runners.model.FrameworkMethod.invokeExplosively(FrameworkMethod.java:61)
		at org.junit.internal.runners.statements.InvokeMethod.evaluate(InvokeMethod.java:17)
		at org.junit.internal.runners.statements.ExpectException.evaluate(ExpectException.java:19)
		at org.junit.internal.runners.statements.RunBefores.evaluate(RunBefores.java:26)
		at org.junit.internal.runners.statements.RunAfters.evaluate(RunAfters.java:27)
		at org.junit.rules.TestWatcher$1.evaluate(TestWatcher.java:61)
		at org.junit.runners.ParentRunner$3.evaluate(ParentRunner.java:306)
		at org.junit.runners.BlockJUnit4ClassRunner$1.evaluate(BlockJUnit4ClassRunner.java:100)
		at org.junit.runners.ParentRunner.runLeaf(ParentRunner.java:366)
		at org.junit.runners.BlockJUnit4ClassRunner.runChild(BlockJUnit4ClassRunner.java:103)
		at org.junit.runners.BlockJUnit4ClassRunner.runChild(BlockJUnit4ClassRunner.java:63)
		at org.junit.runners.ParentRunner$4.run(ParentRunner.java:331)
		at org.junit.runners.ParentRunner$1.schedule(ParentRunner.java:79)
		at org.junit.runners.ParentRunner.runChildren(ParentRunner.java:329)
		at org.junit.runners.ParentRunner.access$100(ParentRunner.java:66)
		at org.junit.runners.ParentRunner$2.evaluate(ParentRunner.java:293)
		at org.junit.internal.runners.statements.RunBefores.evaluate(RunBefores.java:26)
		at org.junit.internal.runners.statements.RunAfters.evaluate(RunAfters.java:27)
		at org.junit.runners.ParentRunner$3.evaluate(ParentRunner.java:306)
		at org.junit.runners.ParentRunner.run(ParentRunner.java:413)
		at junit.framework.JUnit4TestAdapter.run(JUnit4TestAdapter.java:50)
		at org.apache.tools.ant.taskdefs.optional.junit.JUnitTestRunner.run(JUnitTestRunner.java:535)
		at org.apache.tools.ant.taskdefs.optional.junit.JUnitTestRunner.launch(JUnitTestRunner.java:1197)
		at org.apache.tools.ant.taskdefs.optional.junit.JUnitTestRunner.main(JUnitTestRunner.java:1042)
25-Jun-2022 08:53:53.121 INFO [main] org.apache.coyote.AbstractProtocol.destroy Destroying ProtocolHandler ["http-nio2-127.0.0.1-auto-8"]
25-Jun-2022 08:53:53.121 INFO [main] org.apache.catalina.startup.LoggingBaseTest.setUp Starting test case [testSetLocale06]
25-Jun-2022 08:53:53.122 WARNING [main] org.apache.catalina.connector.Response.setLocale The encoding [unknown] is not recognised by the JRE
	java.io.UnsupportedEncodingException: The character encoding [unknown] is not supported
		at org.apache.tomcat.util.buf.B2CConverter.getCharset(B2CConverter.java:65)
		at org.apache.coyote.Response.setCharacterEncoding(Response.java:514)
		at org.apache.catalina.connector.Response.setLocale(Response.java:852)
		at org.apache.catalina.connector.TestResponse.testSetLocale06(TestResponse.java:905)
		at java.base/jdk.internal.reflect.NativeMethodAccessorImpl.invoke0(Native Method)
		at java.base/jdk.internal.reflect.NativeMethodAccessorImpl.invoke(NativeMethodAccessorImpl.java:62)
		at java.base/jdk.internal.reflect.DelegatingMethodAccessorImpl.invoke(DelegatingMethodAccessorImpl.java:43)
		at java.base/java.lang.reflect.Method.invoke(Method.java:566)
		at org.junit.runners.model.FrameworkMethod$1.runReflectiveCall(FrameworkMethod.java:59)
		at org.junit.internal.runners.model.ReflectiveCallable.run(ReflectiveCallable.java:12)
		at org.junit.runners.model.FrameworkMethod.invokeExplosively(FrameworkMethod.java:61)
		at org.junit.internal.runners.statements.InvokeMethod.evaluate(InvokeMethod.java:17)
		at org.junit.internal.runners.statements.RunBefores.evaluate(RunBefores.java:26)
		at org.junit.internal.runners.statements.RunAfters.evaluate(RunAfters.java:27)
		at org.junit.rules.TestWatcher$1.evaluate(TestWatcher.java:61)
		at org.junit.runners.ParentRunner$3.evaluate(ParentRunner.java:306)
		at org.junit.runners.BlockJUnit4ClassRunner$1.evaluate(BlockJUnit4ClassRunner.java:100)
		at org.junit.runners.ParentRunner.runLeaf(ParentRunner.java:366)
		at org.junit.runners.BlockJUnit4ClassRunner.runChild(BlockJUnit4ClassRunner.java:103)
		at org.junit.runners.BlockJUnit4ClassRunner.runChild(BlockJUnit4ClassRunner.java:63)
		at org.junit.runners.ParentRunner$4.run(ParentRunner.java:331)
		at org.junit.runners.ParentRunner$1.schedule(ParentRunner.java:79)
		at org.junit.runners.ParentRunner.runChildren(ParentRunner.java:329)
		at org.junit.runners.ParentRunner.access$100(ParentRunner.java:66)
		at org.junit.runners.ParentRunner$2.evaluate(ParentRunner.java:293)
		at org.junit.internal.runners.statements.RunBefores.evaluate(RunBefores.java:26)
		at org.junit.internal.runners.statements.RunAfters.evaluate(RunAfters.java:27)
		at org.junit.runners.ParentRunner$3.evaluate(ParentRunner.java:306)
		at org.junit.runners.ParentRunner.run(ParentRunner.java:413)
		at junit.framework.JUnit4TestAdapter.run(JUnit4TestAdapter.java:50)
		at org.apache.tools.ant.taskdefs.optional.junit.JUnitTestRunner.run(JUnitTestRunner.java:535)
		at org.apache.tools.ant.taskdefs.optional.junit.JUnitTestRunner.launch(JUnitTestRunner.java:1197)
		at org.apache.tools.ant.taskdefs.optional.junit.JUnitTestRunner.main(JUnitTestRunner.java:1042)
25-Jun-2022 08:53:53.124 INFO [main] org.apache.coyote.AbstractProtocol.destroy Destroying ProtocolHandler ["http-nio2-127.0.0.1-auto-9"]
25-Jun-2022 08:53:53.125 INFO [main] org.apache.catalina.startup.LoggingBaseTest.setUp Starting test case [testSetLocale07]
25-Jun-2022 08:53:53.125 INFO [main] org.apache.coyote.AbstractProtocol.destroy Destroying ProtocolHandler ["http-nio2-127.0.0.1-auto-10"]
25-Jun-2022 08:53:53.126 INFO [main] org.apache.catalina.startup.LoggingBaseTest.setUp Starting test case [testSetLocale08]
25-Jun-2022 08:53:53.129 INFO [main] org.apache.coyote.AbstractProtocol.destroy Destroying ProtocolHandler ["http-nio2-127.0.0.1-auto-11"]
25-Jun-2022 08:53:53.129 INFO [main] org.apache.catalina.startup.LoggingBaseTest.setUp Starting test case [testBug49598]
25-Jun-2022 08:53:53.404 INFO [main] org.apache.coyote.AbstractProtocol.init Initializing ProtocolHandler ["http-nio2-127.0.0.1-auto-12"]
25-Jun-2022 08:53:53.438 INFO [main] org.apache.catalina.core.StandardService.startInternal Starting service [Tomcat]
25-Jun-2022 08:53:53.438 INFO [main] org.apache.catalina.core.StandardEngine.startInternal Starting Servlet engine: [Apache Tomcat/10.0.23-dev]
25-Jun-2022 08:53:53.545 INFO [main] org.apache.coyote.AbstractProtocol.start Starting ProtocolHandler ["http-nio2-127.0.0.1-auto-12-34191"]
25-Jun-2022 08:53:53.599 INFO [main] org.apache.coyote.AbstractProtocol.pause Pausing ProtocolHandler ["http-nio2-127.0.0.1-auto-12-34191"]
25-Jun-2022 08:53:53.600 INFO [main] org.apache.catalina.core.StandardService.stopInternal Stopping service [Tomcat]
25-Jun-2022 08:53:53.608 INFO [main] org.apache.coyote.AbstractProtocol.stop Stopping ProtocolHandler ["http-nio2-127.0.0.1-auto-12-34191"]
25-Jun-2022 08:53:53.609 INFO [main] org.apache.coyote.AbstractProtocol.destroy Destroying ProtocolHandler ["http-nio2-127.0.0.1-auto-12-34191"]
25-Jun-2022 08:53:53.617 INFO [main] org.apache.catalina.startup.LoggingBaseTest.setUp Starting test case [testBug52811]
25-Jun-2022 08:53:53.619 INFO [main] org.apache.coyote.AbstractProtocol.init Initializing ProtocolHandler ["http-nio2-127.0.0.1-auto-13"]
25-Jun-2022 08:53:53.622 INFO [main] org.apache.catalina.core.StandardService.startInternal Starting service [Tomcat]
25-Jun-2022 08:53:53.623 INFO [main] org.apache.catalina.core.StandardEngine.startInternal Starting Servlet engine: [Apache Tomcat/10.0.23-dev]
25-Jun-2022 08:53:53.628 INFO [main] org.apache.coyote.AbstractProtocol.start Starting ProtocolHandler ["http-nio2-127.0.0.1-auto-13-46697"]
25-Jun-2022 08:53:53.636 INFO [main] org.apache.coyote.AbstractProtocol.pause Pausing ProtocolHandler ["http-nio2-127.0.0.1-auto-13-46697"]
25-Jun-2022 08:53:53.643 INFO [main] org.apache.catalina.core.StandardService.stopInternal Stopping service [Tomcat]
25-Jun-2022 08:53:53.645 INFO [main] org.apache.coyote.AbstractProtocol.stop Stopping ProtocolHandler ["http-nio2-127.0.0.1-auto-13-46697"]
25-Jun-2022 08:53:53.646 INFO [main] org.apache.coyote.AbstractProtocol.destroy Destroying ProtocolHandler ["http-nio2-127.0.0.1-auto-13-46697"]
25-Jun-2022 08:53:53.657 INFO [main] org.apache.catalina.startup.LoggingBaseTest.setUp Starting test case [testSetContentType01]
25-Jun-2022 08:53:53.665 INFO [main] org.apache.coyote.AbstractProtocol.destroy Destroying ProtocolHandler ["http-nio2-127.0.0.1-auto-14"]
25-Jun-2022 08:53:53.668 INFO [main] org.apache.catalina.startup.LoggingBaseTest.setUp Starting test case [testSetContentType02]
25-Jun-2022 08:53:53.669 INFO [main] org.apache.coyote.AbstractProtocol.destroy Destroying ProtocolHandler ["http-nio2-127.0.0.1-auto-15"]
25-Jun-2022 08:53:53.670 INFO [main] org.apache.catalina.startup.LoggingBaseTest.setUp Starting test case [testSetContentType03]
25-Jun-2022 08:53:53.671 INFO [main] org.apache.coyote.AbstractProtocol.destroy Destroying ProtocolHandler ["http-nio2-127.0.0.1-auto-16"]
25-Jun-2022 08:53:53.672 INFO [main] org.apache.catalina.startup.LoggingBaseTest.setUp Starting test case [testSetContentType04]
25-Jun-2022 08:53:53.673 INFO [main] org.apache.coyote.AbstractProtocol.destroy Destroying ProtocolHandler ["http-nio2-127.0.0.1-auto-17"]
25-Jun-2022 08:53:53.673 INFO [main] org.apache.catalina.startup.LoggingBaseTest.setUp Starting test case [testSetContentType05]
25-Jun-2022 08:53:53.674 WARNING [main] org.apache.catalina.connector.Response.setContentType The encoding [unknown] is not recognised by the JRE
	java.io.UnsupportedEncodingException: The character encoding [unknown] is not supported
		at org.apache.tomcat.util.buf.B2CConverter.getCharset(B2CConverter.java:65)
		at org.apache.coyote.Response.setCharacterEncoding(Response.java:514)
		at org.apache.catalina.connector.Response.setContentType(Response.java:758)
		at org.apache.catalina.connector.TestResponse.testSetContentType05(TestResponse.java:815)
		at java.base/jdk.internal.reflect.NativeMethodAccessorImpl.invoke0(Native Method)
		at java.base/jdk.internal.reflect.NativeMethodAccessorImpl.invoke(NativeMethodAccessorImpl.java:62)
		at java.base/jdk.internal.reflect.DelegatingMethodAccessorImpl.invoke(DelegatingMethodAccessorImpl.java:43)
		at java.base/java.lang.reflect.Method.invoke(Method.java:566)
		at org.junit.runners.model.FrameworkMethod$1.runReflectiveCall(FrameworkMethod.java:59)
		at org.junit.internal.runners.model.ReflectiveCallable.run(ReflectiveCallable.java:12)
		at org.junit.runners.model.FrameworkMethod.invokeExplosively(FrameworkMethod.java:61)
		at org.junit.internal.runners.statements.InvokeMethod.evaluate(InvokeMethod.java:17)
		at org.junit.internal.runners.statements.ExpectException.evaluate(ExpectException.java:19)
		at org.junit.internal.runners.statements.RunBefores.evaluate(RunBefores.java:26)
		at org.junit.internal.runners.statements.RunAfters.evaluate(RunAfters.java:27)
		at org.junit.rules.TestWatcher$1.evaluate(TestWatcher.java:61)
		at org.junit.runners.ParentRunner$3.evaluate(ParentRunner.java:306)
		at org.junit.runners.BlockJUnit4ClassRunner$1.evaluate(BlockJUnit4ClassRunner.java:100)
		at org.junit.runners.ParentRunner.runLeaf(ParentRunner.java:366)
		at org.junit.runners.BlockJUnit4ClassRunner.runChild(BlockJUnit4ClassRunner.java:103)
		at org.junit.runners.BlockJUnit4ClassRunner.runChild(BlockJUnit4ClassRunner.java:63)
		at org.junit.runners.ParentRunner$4.run(ParentRunner.java:331)
		at org.junit.runners.ParentRunner$1.schedule(ParentRunner.java:79)
		at org.junit.runners.ParentRunner.runChildren(ParentRunner.java:329)
		at org.junit.runners.ParentRunner.access$100(ParentRunner.java:66)
		at org.junit.runners.ParentRunner$2.evaluate(ParentRunner.java:293)
		at org.junit.internal.runners.statements.RunBefores.evaluate(RunBefores.java:26)
		at org.junit.internal.runners.statements.RunAfters.evaluate(RunAfters.java:27)
		at org.junit.runners.ParentRunner$3.evaluate(ParentRunner.java:306)
		at org.junit.runners.ParentRunner.run(ParentRunner.java:413)
		at junit.framework.JUnit4TestAdapter.run(JUnit4TestAdapter.java:50)
		at org.apache.tools.ant.taskdefs.optional.junit.JUnitTestRunner.run(JUnitTestRunner.java:535)
		at org.apache.tools.ant.taskdefs.optional.junit.JUnitTestRunner.launch(JUnitTestRunner.java:1197)
		at org.apache.tools.ant.taskdefs.optional.junit.JUnitTestRunner.main(JUnitTestRunner.java:1042)
25-Jun-2022 08:53:53.674 WARNING [main] org.apache.catalina.connector.Response.setCharacterEncoding The encoding [unknown] is not recognised by the JRE
	java.io.UnsupportedEncodingException: The character encoding [unknown] is not supported
		at org.apache.tomcat.util.buf.B2CConverter.getCharset(B2CConverter.java:65)
		at org.apache.coyote.Response.setCharacterEncoding(Response.java:514)
		at org.apache.catalina.connector.Response.setCharacterEncoding(Response.java:795)
		at org.apache.catalina.connector.Response.getWriter(Response.java:575)
		at org.apache.catalina.connector.TestResponse.testSetContentType05(TestResponse.java:817)
		at java.base/jdk.internal.reflect.NativeMethodAccessorImpl.invoke0(Native Method)
		at java.base/jdk.internal.reflect.NativeMethodAccessorImpl.invoke(NativeMethodAccessorImpl.java:62)
		at java.base/jdk.internal.reflect.DelegatingMethodAccessorImpl.invoke(DelegatingMethodAccessorImpl.java:43)
		at java.base/java.lang.reflect.Method.invoke(Method.java:566)
		at org.junit.runners.model.FrameworkMethod$1.runReflectiveCall(FrameworkMethod.java:59)
		at org.junit.internal.runners.model.ReflectiveCallable.run(ReflectiveCallable.java:12)
		at org.junit.runners.model.FrameworkMethod.invokeExplosively(FrameworkMethod.java:61)
		at org.junit.internal.runners.statements.InvokeMethod.evaluate(InvokeMethod.java:17)

Continuation...

		at org.junit.internal.runners.statements.ExpectException.evaluate(ExpectException.java:19)
		at org.junit.internal.runners.statements.RunBefores.evaluate(RunBefores.java:26)
		at org.junit.internal.runners.statements.RunAfters.evaluate(RunAfters.java:27)
		at org.junit.rules.TestWatcher$1.evaluate(TestWatcher.java:61)
		at org.junit.runners.ParentRunner$3.evaluate(ParentRunner.java:306)
		at org.junit.runners.BlockJUnit4ClassRunner$1.evaluate(BlockJUnit4ClassRunner.java:100)
		at org.junit.runners.ParentRunner.runLeaf(ParentRunner.java:366)
		at org.junit.runners.BlockJUnit4ClassRunner.runChild(BlockJUnit4ClassRunner.java:103)
		at org.junit.runners.BlockJUnit4ClassRunner.runChild(BlockJUnit4ClassRunner.java:63)
		at org.junit.runners.ParentRunner$4.run(ParentRunner.java:331)
		at org.junit.runners.ParentRunner$1.schedule(ParentRunner.java:79)
		at org.junit.runners.ParentRunner.runChildren(ParentRunner.java:329)
		at org.junit.runners.ParentRunner.access$100(ParentRunner.java:66)
		at org.junit.runners.ParentRunner$2.evaluate(ParentRunner.java:293)
		at org.junit.internal.runners.statements.RunBefores.evaluate(RunBefores.java:26)
		at org.junit.internal.runners.statements.RunAfters.evaluate(RunAfters.java:27)
		at org.junit.runners.ParentRunner$3.evaluate(ParentRunner.java:306)
		at org.junit.runners.ParentRunner.run(ParentRunner.java:413)
		at junit.framework.JUnit4TestAdapter.run(JUnit4TestAdapter.java:50)
		at org.apache.tools.ant.taskdefs.optional.junit.JUnitTestRunner.run(JUnitTestRunner.java:535)
		at org.apache.tools.ant.taskdefs.optional.junit.JUnitTestRunner.launch(JUnitTestRunner.java:1197)
		at org.apache.tools.ant.taskdefs.optional.junit.JUnitTestRunner.main(JUnitTestRunner.java:1042)
25-Jun-2022 08:53:53.675 INFO [main] org.apache.coyote.AbstractProtocol.destroy Destroying ProtocolHandler ["http-nio2-127.0.0.1-auto-18"]
25-Jun-2022 08:53:53.675 INFO [main] org.apache.catalina.startup.LoggingBaseTest.setUp Starting test case [testSetContentType06]
25-Jun-2022 08:53:53.676 WARNING [main] org.apache.catalina.connector.Response.setContentType The encoding [unknown] is not recognised by the JRE
	java.io.UnsupportedEncodingException: The character encoding [unknown] is not supported
		at org.apache.tomcat.util.buf.B2CConverter.getCharset(B2CConverter.java:65)
		at org.apache.coyote.Response.setCharacterEncoding(Response.java:514)
		at org.apache.catalina.connector.Response.setContentType(Response.java:758)
		at org.apache.catalina.connector.TestResponse.testSetContentType06(TestResponse.java:827)
		at java.base/jdk.internal.reflect.NativeMethodAccessorImpl.invoke0(Native Method)
		at java.base/jdk.internal.reflect.NativeMethodAccessorImpl.invoke(NativeMethodAccessorImpl.java:62)
		at java.base/jdk.internal.reflect.DelegatingMethodAccessorImpl.invoke(DelegatingMethodAccessorImpl.java:43)
		at java.base/java.lang.reflect.Method.invoke(Method.java:566)
		at org.junit.runners.model.FrameworkMethod$1.runReflectiveCall(FrameworkMethod.java:59)
		at org.junit.internal.runners.model.ReflectiveCallable.run(ReflectiveCallable.java:12)
		at org.junit.runners.model.FrameworkMethod.invokeExplosively(FrameworkMethod.java:61)
		at org.junit.internal.runners.statements.InvokeMethod.evaluate(InvokeMethod.java:17)
		at org.junit.internal.runners.statements.RunBefores.evaluate(RunBefores.java:26)
		at org.junit.internal.runners.statements.RunAfters.evaluate(RunAfters.java:27)
		at org.junit.rules.TestWatcher$1.evaluate(TestWatcher.java:61)
		at org.junit.runners.ParentRunner$3.evaluate(ParentRunner.java:306)
		at org.junit.runners.BlockJUnit4ClassRunner$1.evaluate(BlockJUnit4ClassRunner.java:100)
		at org.junit.runners.ParentRunner.runLeaf(ParentRunner.java:366)
		at org.junit.runners.BlockJUnit4ClassRunner.runChild(BlockJUnit4ClassRunner.java:103)
		at org.junit.runners.BlockJUnit4ClassRunner.runChild(BlockJUnit4ClassRunner.java:63)
		at org.junit.runners.ParentRunner$4.run(ParentRunner.java:331)
		at org.junit.runners.ParentRunner$1.schedule(ParentRunner.java:79)
		at org.junit.runners.ParentRunner.runChildren(ParentRunner.java:329)
		at org.junit.runners.ParentRunner.access$100(ParentRunner.java:66)
		at org.junit.runners.ParentRunner$2.evaluate(ParentRunner.java:293)
		at org.junit.internal.runners.statements.RunBefores.evaluate(RunBefores.java:26)
		at org.junit.internal.runners.statements.RunAfters.evaluate(RunAfters.java:27)
		at org.junit.runners.ParentRunner$3.evaluate(ParentRunner.java:306)
		at org.junit.runners.ParentRunner.run(ParentRunner.java:413)
		at junit.framework.JUnit4TestAdapter.run(JUnit4TestAdapter.java:50)
		at org.apache.tools.ant.taskdefs.optional.junit.JUnitTestRunner.run(JUnitTestRunner.java:535)
		at org.apache.tools.ant.taskdefs.optional.junit.JUnitTestRunner.launch(JUnitTestRunner.java:1197)
		at org.apache.tools.ant.taskdefs.optional.junit.JUnitTestRunner.main(JUnitTestRunner.java:1042)
25-Jun-2022 08:53:53.677 INFO [main] org.apache.coyote.AbstractProtocol.destroy Destroying ProtocolHandler ["http-nio2-127.0.0.1-auto-19"]
25-Jun-2022 08:53:53.677 INFO [main] org.apache.catalina.startup.LoggingBaseTest.setUp Starting test case [testBug53062a]
25-Jun-2022 08:53:53.679 INFO [main] org.apache.coyote.AbstractProtocol.destroy Destroying ProtocolHandler ["http-nio2-127.0.0.1-auto-20"]
25-Jun-2022 08:53:53.680 INFO [main] org.apache.catalina.startup.LoggingBaseTest.setUp Starting test case [testBug53062b]
25-Jun-2022 08:53:53.681 INFO [main] org.apache.coyote.AbstractProtocol.destroy Destroying ProtocolHandler ["http-nio2-127.0.0.1-auto-21"]
25-Jun-2022 08:53:53.681 INFO [main] org.apache.catalina.startup.LoggingBaseTest.setUp Starting test case [testBug53062c]
25-Jun-2022 08:53:53.682 INFO [main] org.apache.coyote.AbstractProtocol.destroy Destroying ProtocolHandler ["http-nio2-127.0.0.1-auto-22"]
25-Jun-2022 08:53:53.682 INFO [main] org.apache.catalina.startup.LoggingBaseTest.setUp Starting test case [testBug53062d]
25-Jun-2022 08:53:53.683 INFO [main] org.apache.coyote.AbstractProtocol.destroy Destroying ProtocolHandler ["http-nio2-127.0.0.1-auto-23"]
25-Jun-2022 08:53:53.683 INFO [main] org.apache.catalina.startup.LoggingBaseTest.setUp Starting test case [testBug53062e]
25-Jun-2022 08:53:53.684 INFO [main] org.apache.coyote.AbstractProtocol.destroy Destroying ProtocolHandler ["http-nio2-127.0.0.1-auto-24"]
25-Jun-2022 08:53:53.684 INFO [main] org.apache.catalina.startup.LoggingBaseTest.setUp Starting test case [testBug53062f]
25-Jun-2022 08:53:53.685 INFO [main] org.apache.coyote.AbstractProtocol.destroy Destroying ProtocolHandler ["http-nio2-127.0.0.1-auto-25"]
25-Jun-2022 08:53:53.685 INFO [main] org.apache.catalina.startup.LoggingBaseTest.setUp Starting test case [testBug53062g]
25-Jun-2022 08:53:53.686 INFO [main] org.apache.coyote.AbstractProtocol.destroy Destroying ProtocolHandler ["http-nio2-127.0.0.1-auto-26"]
25-Jun-2022 08:53:53.686 INFO [main] org.apache.catalina.startup.LoggingBaseTest.setUp Starting test case [testBug53062h]
25-Jun-2022 08:53:53.687 INFO [main] org.apache.coyote.AbstractProtocol.destroy Destroying ProtocolHandler ["http-nio2-127.0.0.1-auto-27"]
25-Jun-2022 08:53:53.687 INFO [main] org.apache.catalina.startup.LoggingBaseTest.setUp Starting test case [testBug53062i]
25-Jun-2022 08:53:53.688 INFO [main] org.apache.coyote.AbstractProtocol.destroy Destroying ProtocolHandler ["http-nio2-127.0.0.1-auto-28"]
25-Jun-2022 08:53:53.688 INFO [main] org.apache.catalina.startup.LoggingBaseTest.setUp Starting test case [testBug53062j]
25-Jun-2022 08:53:53.689 INFO [main] org.apache.coyote.AbstractProtocol.destroy Destroying ProtocolHandler ["http-nio2-127.0.0.1-auto-29"]
25-Jun-2022 08:53:53.689 INFO [main] org.apache.catalina.startup.LoggingBaseTest.setUp Starting test case [testBug53062k]
25-Jun-2022 08:53:53.689 INFO [main] org.apache.coyote.AbstractProtocol.destroy Destroying ProtocolHandler ["http-nio2-127.0.0.1-auto-30"]
25-Jun-2022 08:53:53.690 INFO [main] org.apache.catalina.startup.LoggingBaseTest.setUp Starting test case [testBug53062l]
25-Jun-2022 08:53:53.690 INFO [main] org.apache.coyote.AbstractProtocol.destroy Destroying ProtocolHandler ["http-nio2-127.0.0.1-auto-31"]
25-Jun-2022 08:53:53.691 INFO [main] org.apache.catalina.startup.LoggingBaseTest.setUp Starting test case [testBug53062m]
25-Jun-2022 08:53:53.691 INFO [main] org.apache.coyote.AbstractProtocol.destroy Destroying ProtocolHandler ["http-nio2-127.0.0.1-auto-32"]
25-Jun-2022 08:53:53.692 INFO [main] org.apache.catalina.startup.LoggingBaseTest.setUp Starting test case [testBug53062n]
25-Jun-2022 08:53:53.692 INFO [main] org.apache.coyote.AbstractProtocol.destroy Destroying ProtocolHandler ["http-nio2-127.0.0.1-auto-33"]
25-Jun-2022 08:53:53.693 INFO [main] org.apache.catalina.startup.LoggingBaseTest.setUp Starting test case [testBug53062o]
25-Jun-2022 08:53:53.693 INFO [main] org.apache.coyote.AbstractProtocol.destroy Destroying ProtocolHandler ["http-nio2-127.0.0.1-auto-34"]
25-Jun-2022 08:53:53.694 INFO [main] org.apache.catalina.startup.LoggingBaseTest.setUp Starting test case [testBug53062p]
25-Jun-2022 08:53:53.694 INFO [main] org.apache.coyote.AbstractProtocol.destroy Destroying ProtocolHandler ["http-nio2-127.0.0.1-auto-35"]
25-Jun-2022 08:53:53.695 INFO [main] org.apache.catalina.startup.LoggingBaseTest.setUp Starting test case [testBug53469a]
25-Jun-2022 08:53:53.695 INFO [main] org.apache.coyote.AbstractProtocol.destroy Destroying ProtocolHandler ["http-nio2-127.0.0.1-auto-36"]
25-Jun-2022 08:53:53.696 INFO [main] org.apache.catalina.startup.LoggingBaseTest.setUp Starting test case [testBug53469b]
25-Jun-2022 08:53:53.696 INFO [main] org.apache.coyote.AbstractProtocol.destroy Destroying ProtocolHandler ["http-nio2-127.0.0.1-auto-37"]
25-Jun-2022 08:53:53.697 INFO [main] org.apache.catalina.startup.LoggingBaseTest.setUp Starting test case [testCharset]
25-Jun-2022 08:53:53.698 INFO [main] org.apache.coyote.AbstractProtocol.init Initializing ProtocolHandler ["http-nio2-127.0.0.1-auto-38"]
25-Jun-2022 08:53:53.701 INFO [main] org.apache.catalina.core.StandardService.startInternal Starting service [Tomcat]
25-Jun-2022 08:53:53.701 INFO [main] org.apache.catalina.core.StandardEngine.startInternal Starting Servlet engine: [Apache Tomcat/10.0.23-dev]
25-Jun-2022 08:53:53.707 INFO [main] org.apache.coyote.AbstractProtocol.start Starting ProtocolHandler ["http-nio2-127.0.0.1-auto-38-38739"]
25-Jun-2022 08:53:53.711 INFO [main] org.apache.coyote.AbstractProtocol.pause Pausing ProtocolHandler ["http-nio2-127.0.0.1-auto-38-38739"]
25-Jun-2022 08:53:53.712 INFO [main] org.apache.catalina.core.StandardService.stopInternal Stopping service [Tomcat]
25-Jun-2022 08:53:53.714 INFO [main] org.apache.coyote.AbstractProtocol.stop Stopping ProtocolHandler ["http-nio2-127.0.0.1-auto-38-38739"]
25-Jun-2022 08:53:53.715 INFO [main] org.apache.coyote.AbstractProtocol.destroy Destroying ProtocolHandler ["http-nio2-127.0.0.1-auto-38-38739"]
25-Jun-2022 08:53:53.728 INFO [main] org.apache.catalina.startup.LoggingBaseTest.setUp Starting test case [testSetCharacterEncoding01]
25-Jun-2022 08:53:53.729 INFO [main] org.apache.coyote.AbstractProtocol.destroy Destroying ProtocolHandler ["http-nio2-127.0.0.1-auto-39"]
25-Jun-2022 08:53:53.730 INFO [main] org.apache.catalina.startup.LoggingBaseTest.setUp Starting test case [testSetCharacterEncoding02]
25-Jun-2022 08:53:53.730 INFO [main] org.apache.coyote.AbstractProtocol.destroy Destroying ProtocolHandler ["http-nio2-127.0.0.1-auto-40"]
25-Jun-2022 08:53:53.731 INFO [main] org.apache.catalina.startup.LoggingBaseTest.setUp Starting test case [testSetCharacterEncoding03]
25-Jun-2022 08:53:53.731 INFO [main] org.apache.coyote.AbstractProtocol.destroy Destroying ProtocolHandler ["http-nio2-127.0.0.1-auto-41"]
25-Jun-2022 08:53:53.732 INFO [main] org.apache.catalina.startup.LoggingBaseTest.setUp Starting test case [testSetCharacterEncoding04]
25-Jun-2022 08:53:53.732 INFO [main] org.apache.coyote.AbstractProtocol.destroy Destroying ProtocolHandler ["http-nio2-127.0.0.1-auto-42"]
25-Jun-2022 08:53:53.733 INFO [main] org.apache.catalina.startup.LoggingBaseTest.setUp Starting test case [testSetCharacterEncoding05]
25-Jun-2022 08:53:53.733 INFO [main] org.apache.coyote.AbstractProtocol.destroy Destroying ProtocolHandler ["http-nio2-127.0.0.1-auto-43"]
25-Jun-2022 08:53:53.734 INFO [main] org.apache.catalina.startup.LoggingBaseTest.setUp Starting test case [testSetCharacterEncoding06]
25-Jun-2022 08:53:53.734 WARNING [main] org.apache.catalina.connector.Response.setCharacterEncoding The encoding [unknown] is not recognised by the JRE
	java.io.UnsupportedEncodingException: The character encoding [unknown] is not supported
		at org.apache.tomcat.util.buf.B2CConverter.getCharset(B2CConverter.java:65)
		at org.apache.coyote.Response.setCharacterEncoding(Response.java:514)
		at org.apache.catalina.connector.Response.setCharacterEncoding(Response.java:795)
		at org.apache.catalina.connector.TestResponse.testSetCharacterEncoding06(TestResponse.java:719)
		at java.base/jdk.internal.reflect.NativeMethodAccessorImpl.invoke0(Native Method)
		at java.base/jdk.internal.reflect.NativeMethodAccessorImpl.invoke(NativeMethodAccessorImpl.java:62)
		at java.base/jdk.internal.reflect.DelegatingMethodAccessorImpl.invoke(DelegatingMethodAccessorImpl.java:43)
		at java.base/java.lang.reflect.Method.invoke(Method.java:566)
		at org.junit.runners.model.FrameworkMethod$1.runReflectiveCall(FrameworkMethod.java:59)
		at org.junit.internal.runners.model.ReflectiveCallable.run(ReflectiveCallable.java:12)
		at org.junit.runners.model.FrameworkMethod.invokeExplosively(FrameworkMethod.java:61)
		at org.junit.internal.runners.statements.InvokeMethod.evaluate(InvokeMethod.java:17)
		at org.junit.internal.runners.statements.ExpectException.evaluate(ExpectException.java:19)
		at org.junit.internal.runners.statements.RunBefores.evaluate(RunBefores.java:26)
		at org.junit.internal.runners.statements.RunAfters.evaluate(RunAfters.java:27)
		at org.junit.rules.TestWatcher$1.evaluate(TestWatcher.java:61)
		at org.junit.runners.ParentRunner$3.evaluate(ParentRunner.java:306)
		at org.junit.runners.BlockJUnit4ClassRunner$1.evaluate(BlockJUnit4ClassRunner.java:100)
		at org.junit.runners.ParentRunner.runLeaf(ParentRunner.java:366)
		at org.junit.runners.BlockJUnit4ClassRunner.runChild(BlockJUnit4ClassRunner.java:103)
		at org.junit.runners.BlockJUnit4ClassRunner.runChild(BlockJUnit4ClassRunner.java:63)
		at org.junit.runners.ParentRunner$4.run(ParentRunner.java:331)
		at org.junit.runners.ParentRunner$1.schedule(ParentRunner.java:79)
		at org.junit.runners.ParentRunner.runChildren(ParentRunner.java:329)
		at org.junit.runners.ParentRunner.access$100(ParentRunner.java:66)
		at org.junit.runners.ParentRunner$2.evaluate(ParentRunner.java:293)
		at org.junit.internal.runners.statements.RunBefores.evaluate(RunBefores.java:26)
		at org.junit.internal.runners.statements.RunAfters.evaluate(RunAfters.java:27)
		at org.junit.runners.ParentRunner$3.evaluate(ParentRunner.java:306)
		at org.junit.runners.ParentRunner.run(ParentRunner.java:413)
		at junit.framework.JUnit4TestAdapter.run(JUnit4TestAdapter.java:50)
		at org.apache.tools.ant.taskdefs.optional.junit.JUnitTestRunner.run(JUnitTestRunner.java:535)
		at org.apache.tools.ant.taskdefs.optional.junit.JUnitTestRunner.launch(JUnitTestRunner.java:1197)
		at org.apache.tools.ant.taskdefs.optional.junit.JUnitTestRunner.main(JUnitTestRunner.java:1042)
25-Jun-2022 08:53:53.735 WARNING [main] org.apache.catalina.connector.Response.setCharacterEncoding The encoding [unknown] is not recognised by the JRE
	java.io.UnsupportedEncodingException: The character encoding [unknown] is not supported
		at org.apache.tomcat.util.buf.B2CConverter.getCharset(B2CConverter.java:65)
		at org.apache.coyote.Response.setCharacterEncoding(Response.java:514)
		at org.apache.catalina.connector.Response.setCharacterEncoding(Response.java:795)
		at org.apache.catalina.connector.Response.getWriter(Response.java:575)
		at org.apache.catalina.connector.TestResponse.testSetCharacterEncoding06(TestResponse.java:721)
		at java.base/jdk.internal.reflect.NativeMethodAccessorImpl.invoke0(Native Method)
		at java.base/jdk.internal.reflect.NativeMethodAccessorImpl.invoke(NativeMethodAccessorImpl.java:62)
		at java.base/jdk.internal.reflect.DelegatingMethodAccessorImpl.invoke(DelegatingMethodAccessorImpl.java:43)
		at java.base/java.lang.reflect.Method.invoke(Method.java:566)
		at org.junit.runners.model.FrameworkMethod$1.runReflectiveCall(FrameworkMethod.java:59)
		at org.junit.internal.runners.model.ReflectiveCallable.run(ReflectiveCallable.java:12)
		at org.junit.runners.model.FrameworkMethod.invokeExplosively(FrameworkMethod.java:61)
		at org.junit.internal.runners.statements.InvokeMethod.evaluate(InvokeMethod.java:17)
		at org.junit.internal.runners.statements.ExpectException.evaluate(ExpectException.java:19)
		at org.junit.internal.runners.statements.RunBefores.evaluate(RunBefores.java:26)
		at org.junit.internal.runners.statements.RunAfters.evaluate(RunAfters.java:27)
		at org.junit.rules.TestWatcher$1.evaluate(TestWatcher.java:61)
		at org.junit.runners.ParentRunner$3.evaluate(ParentRunner.java:306)
		at org.junit.runners.BlockJUnit4ClassRunner$1.evaluate(BlockJUnit4ClassRunner.java:100)
		at org.junit.runners.ParentRunner.runLeaf(ParentRunner.java:366)
		at org.junit.runners.BlockJUnit4ClassRunner.runChild(BlockJUnit4ClassRunner.java:103)
		at org.junit.runners.BlockJUnit4ClassRunner.runChild(BlockJUnit4ClassRunner.java:63)
		at org.junit.runners.ParentRunner$4.run(ParentRunner.java:331)
		at org.junit.runners.ParentRunner$1.schedule(ParentRunner.java:79)
		at org.junit.runners.ParentRunner.runChildren(ParentRunner.java:329)
		at org.junit.runners.ParentRunner.access$100(ParentRunner.java:66)
		at org.junit.runners.ParentRunner$2.evaluate(ParentRunner.java:293)
		at org.junit.internal.runners.statements.RunBefores.evaluate(RunBefores.java:26)
		at org.junit.internal.runners.statements.RunAfters.evaluate(RunAfters.java:27)
		at org.junit.runners.ParentRunner$3.evaluate(ParentRunner.java:306)
		at org.junit.runners.ParentRunner.run(ParentRunner.java:413)
		at junit.framework.JUnit4TestAdapter.run(JUnit4TestAdapter.java:50)
		at org.apache.tools.ant.taskdefs.optional.junit.JUnitTestRunner.run(JUnitTestRunner.java:535)
		at org.apache.tools.ant.taskdefs.optional.junit.JUnitTestRunner.launch(JUnitTestRunner.java:1197)
		at org.apache.tools.ant.taskdefs.optional.junit.JUnitTestRunner.main(JUnitTestRunner.java:1042)
25-Jun-2022 08:53:53.735 INFO [main] org.apache.coyote.AbstractProtocol.destroy Destroying ProtocolHandler ["http-nio2-127.0.0.1-auto-44"]
25-Jun-2022 08:53:53.736 INFO [main] org.apache.catalina.startup.LoggingBaseTest.setUp Starting test case [testSetCharacterEncoding07]
25-Jun-2022 08:53:53.736 WARNING [main] org.apache.catalina.connector.Response.setCharacterEncoding The encoding [unknown] is not recognised by the JRE
	java.io.UnsupportedEncodingException: The character encoding [unknown] is not supported
		at org.apache.tomcat.util.buf.B2CConverter.getCharset(B2CConverter.java:65)
		at org.apache.coyote.Response.setCharacterEncoding(Response.java:514)
		at org.apache.catalina.connector.Response.setCharacterEncoding(Response.java:795)
		at org.apache.catalina.connector.TestResponse.testSetCharacterEncoding07(TestResponse.java:731)
		at java.base/jdk.internal.reflect.NativeMethodAccessorImpl.invoke0(Native Method)
		at java.base/jdk.internal.reflect.NativeMethodAccessorImpl.invoke(NativeMethodAccessorImpl.java:62)
		at java.base/jdk.internal.reflect.DelegatingMethodAccessorImpl.invoke(DelegatingMethodAccessorImpl.java:43)
		at java.base/java.lang.reflect.Method.invoke(Method.java:566)
		at org.junit.runners.model.FrameworkMethod$1.runReflectiveCall(FrameworkMethod.java:59)
		at org.junit.internal.runners.model.ReflectiveCallable.run(ReflectiveCallable.java:12)

Continuation...

		at org.junit.runners.model.FrameworkMethod.invokeExplosively(FrameworkMethod.java:61)
		at org.junit.internal.runners.statements.InvokeMethod.evaluate(InvokeMethod.java:17)
		at org.junit.internal.runners.statements.RunBefores.evaluate(RunBefores.java:26)
		at org.junit.internal.runners.statements.RunAfters.evaluate(RunAfters.java:27)
		at org.junit.rules.TestWatcher$1.evaluate(TestWatcher.java:61)
		at org.junit.runners.ParentRunner$3.evaluate(ParentRunner.java:306)
		at org.junit.runners.BlockJUnit4ClassRunner$1.evaluate(BlockJUnit4ClassRunner.java:100)
		at org.junit.runners.ParentRunner.runLeaf(ParentRunner.java:366)
		at org.junit.runners.BlockJUnit4ClassRunner.runChild(BlockJUnit4ClassRunner.java:103)
		at org.junit.runners.BlockJUnit4ClassRunner.runChild(BlockJUnit4ClassRunner.java:63)
		at org.junit.runners.ParentRunner$4.run(ParentRunner.java:331)
		at org.junit.runners.ParentRunner$1.schedule(ParentRunner.java:79)
		at org.junit.runners.ParentRunner.runChildren(ParentRunner.java:329)
		at org.junit.runners.ParentRunner.access$100(ParentRunner.java:66)
		at org.junit.runners.ParentRunner$2.evaluate(ParentRunner.java:293)
		at org.junit.internal.runners.statements.RunBefores.evaluate(RunBefores.java:26)
		at org.junit.internal.runners.statements.RunAfters.evaluate(RunAfters.java:27)
		at org.junit.runners.ParentRunner$3.evaluate(ParentRunner.java:306)
		at org.junit.runners.ParentRunner.run(ParentRunner.java:413)
		at junit.framework.JUnit4TestAdapter.run(JUnit4TestAdapter.java:50)
		at org.apache.tools.ant.taskdefs.optional.junit.JUnitTestRunner.run(JUnitTestRunner.java:535)
		at org.apache.tools.ant.taskdefs.optional.junit.JUnitTestRunner.launch(JUnitTestRunner.java:1197)
		at org.apache.tools.ant.taskdefs.optional.junit.JUnitTestRunner.main(JUnitTestRunner.java:1042)
25-Jun-2022 08:53:53.737 INFO [main] org.apache.coyote.AbstractProtocol.destroy Destroying ProtocolHandler ["http-nio2-127.0.0.1-auto-45"]
25-Jun-2022 08:53:53.737 INFO [main] org.apache.catalina.startup.LoggingBaseTest.setUp Starting test case [testSetCharacterEncoding08]
25-Jun-2022 08:53:53.738 INFO [main] org.apache.coyote.AbstractProtocol.destroy Destroying ProtocolHandler ["http-nio2-127.0.0.1-auto-46"]
25-Jun-2022 08:53:53.738 INFO [main] org.apache.catalina.startup.LoggingBaseTest.setUp Starting test case [testEncodeURL01]
25-Jun-2022 08:53:53.739 INFO [main] org.apache.coyote.AbstractProtocol.destroy Destroying ProtocolHandler ["http-nio2-127.0.0.1-auto-47"]
25-Jun-2022 08:53:53.740 INFO [main] org.apache.catalina.startup.LoggingBaseTest.setUp Starting test case [testEncodeURL02]
25-Jun-2022 08:53:53.740 INFO [main] org.apache.coyote.AbstractProtocol.destroy Destroying ProtocolHandler ["http-nio2-127.0.0.1-auto-48"]
25-Jun-2022 08:53:53.741 INFO [main] org.apache.catalina.startup.LoggingBaseTest.setUp Starting test case [testEncodeURL03]
25-Jun-2022 08:53:53.741 INFO [main] org.apache.coyote.AbstractProtocol.destroy Destroying ProtocolHandler ["http-nio2-127.0.0.1-auto-49"]
25-Jun-2022 08:53:53.742 INFO [main] org.apache.catalina.startup.LoggingBaseTest.setUp Starting test case [testEncodeURL04]
25-Jun-2022 08:53:53.742 INFO [main] org.apache.coyote.AbstractProtocol.destroy Destroying ProtocolHandler ["http-nio2-127.0.0.1-auto-50"]
25-Jun-2022 08:53:53.743 INFO [main] org.apache.catalina.startup.LoggingBaseTest.setUp Starting test case [testEncodeURL06]
25-Jun-2022 08:53:53.743 INFO [main] org.apache.coyote.AbstractProtocol.destroy Destroying ProtocolHandler ["http-nio2-127.0.0.1-auto-51"]
25-Jun-2022 08:53:53.744 INFO [main] org.apache.catalina.startup.LoggingBaseTest.setUp Starting test case [testEncodeURL07]
25-Jun-2022 08:53:53.744 INFO [main] org.apache.coyote.AbstractProtocol.destroy Destroying ProtocolHandler ["http-nio2-127.0.0.1-auto-52"]
25-Jun-2022 08:53:53.745 INFO [main] org.apache.catalina.startup.LoggingBaseTest.setUp Starting test case [testEncodeURL08]
25-Jun-2022 08:53:53.745 INFO [main] org.apache.coyote.AbstractProtocol.destroy Destroying ProtocolHandler ["http-nio2-127.0.0.1-auto-53"]
25-Jun-2022 08:53:53.746 INFO [main] org.apache.catalina.startup.LoggingBaseTest.setUp Starting test case [testEncodeURL09]
25-Jun-2022 08:53:53.746 INFO [main] org.apache.coyote.AbstractProtocol.destroy Destroying ProtocolHandler ["http-nio2-127.0.0.1-auto-54"]
25-Jun-2022 08:53:53.747 INFO [main] org.apache.catalina.startup.LoggingBaseTest.setUp Starting test case [testEncodeURL10]
25-Jun-2022 08:53:53.747 INFO [main] org.apache.coyote.AbstractProtocol.destroy Destroying ProtocolHandler ["http-nio2-127.0.0.1-auto-55"]
25-Jun-2022 08:53:53.748 INFO [main] org.apache.catalina.startup.LoggingBaseTest.setUp Starting test case [testEncodeURL11]
25-Jun-2022 08:53:53.748 INFO [main] org.apache.coyote.AbstractProtocol.destroy Destroying ProtocolHandler ["http-nio2-127.0.0.1-auto-56"]
25-Jun-2022 08:53:53.749 INFO [main] org.apache.catalina.startup.LoggingBaseTest.setUp Starting test case [testEncodeURL12]
25-Jun-2022 08:53:53.749 INFO [main] org.apache.coyote.AbstractProtocol.destroy Destroying ProtocolHandler ["http-nio2-127.0.0.1-auto-57"]
25-Jun-2022 08:53:53.750 INFO [main] org.apache.catalina.startup.LoggingBaseTest.setUp Starting test case [testEncodeURL13]
25-Jun-2022 08:53:53.750 INFO [main] org.apache.coyote.AbstractProtocol.destroy Destroying ProtocolHandler ["http-nio2-127.0.0.1-auto-58"]
25-Jun-2022 08:53:53.751 INFO [main] org.apache.catalina.startup.LoggingBaseTest.setUp Starting test case [testEncodeURL14]
25-Jun-2022 08:53:53.751 INFO [main] org.apache.coyote.AbstractProtocol.destroy Destroying ProtocolHandler ["http-nio2-127.0.0.1-auto-59"]
25-Jun-2022 08:53:53.752 INFO [main] org.apache.catalina.startup.LoggingBaseTest.setUp Starting test case [testEncodeURL15]
25-Jun-2022 08:53:53.752 INFO [main] org.apache.coyote.AbstractProtocol.destroy Destroying ProtocolHandler ["http-nio2-127.0.0.1-auto-60"]
25-Jun-2022 08:53:53.753 INFO [main] org.apache.catalina.startup.LoggingBaseTest.setUp Starting test case [testEncodeURL16]
25-Jun-2022 08:53:53.753 INFO [main] org.apache.coyote.AbstractProtocol.destroy Destroying ProtocolHandler ["http-nio2-127.0.0.1-auto-61"]
25-Jun-2022 08:53:53.754 INFO [main] org.apache.catalina.startup.LoggingBaseTest.setUp Starting test case [testEncodeRedirectURL01]
25-Jun-2022 08:53:53.754 INFO [main] org.apache.coyote.AbstractProtocol.destroy Destroying ProtocolHandler ["http-nio2-127.0.0.1-auto-62"]
25-Jun-2022 08:53:53.755 INFO [main] org.apache.catalina.startup.LoggingBaseTest.setUp Starting test case [testEncodeRedirectURL02]
25-Jun-2022 08:53:53.755 INFO [main] org.apache.coyote.AbstractProtocol.destroy Destroying ProtocolHandler ["http-nio2-127.0.0.1-auto-63"]
25-Jun-2022 08:53:53.756 INFO [main] org.apache.catalina.startup.LoggingBaseTest.setUp Starting test case [testEncodeRedirectURL03]
25-Jun-2022 08:53:53.756 INFO [main] org.apache.coyote.AbstractProtocol.destroy Destroying ProtocolHandler ["http-nio2-127.0.0.1-auto-64"]
25-Jun-2022 08:53:53.757 INFO [main] org.apache.catalina.startup.LoggingBaseTest.setUp Starting test case [testEncodeRedirectURL04]
25-Jun-2022 08:53:53.757 INFO [main] org.apache.coyote.AbstractProtocol.destroy Destroying ProtocolHandler ["http-nio2-127.0.0.1-auto-65"]
25-Jun-2022 08:53:53.758 INFO [main] org.apache.catalina.startup.LoggingBaseTest.setUp Starting test case [testEncodeRedirectURL05]
25-Jun-2022 08:53:53.758 INFO [main] org.apache.coyote.AbstractProtocol.destroy Destroying ProtocolHandler ["http-nio2-127.0.0.1-auto-66"]
25-Jun-2022 08:53:53.759 INFO [main] org.apache.catalina.startup.LoggingBaseTest.setUp Starting test case [testEncodeRedirectURL06]
25-Jun-2022 08:53:53.759 INFO [main] org.apache.coyote.AbstractProtocol.destroy Destroying ProtocolHandler ["http-nio2-127.0.0.1-auto-67"]
25-Jun-2022 08:53:53.759 INFO [main] org.apache.catalina.startup.LoggingBaseTest.setUp Starting test case [testEncodeRedirectURL07]
25-Jun-2022 08:53:53.760 INFO [main] org.apache.coyote.AbstractProtocol.destroy Destroying ProtocolHandler ["http-nio2-127.0.0.1-auto-68"]
25-Jun-2022 08:53:53.760 INFO [main] org.apache.catalina.startup.LoggingBaseTest.setUp Starting test case [testEncodeRedirectURL08]
25-Jun-2022 08:53:53.761 INFO [main] org.apache.coyote.AbstractProtocol.destroy Destroying ProtocolHandler ["http-nio2-127.0.0.1-auto-69"]
25-Jun-2022 08:53:53.761 INFO [main] org.apache.catalina.startup.LoggingBaseTest.setUp Starting test case [testEncodeRedirectURL09]
25-Jun-2022 08:53:53.762 INFO [main] org.apache.coyote.AbstractProtocol.destroy Destroying ProtocolHandler ["http-nio2-127.0.0.1-auto-70"]
25-Jun-2022 08:53:53.762 INFO [main] org.apache.catalina.startup.LoggingBaseTest.setUp Starting test case [testEncodeRedirectURL10]
25-Jun-2022 08:53:53.763 INFO [main] org.apache.coyote.AbstractProtocol.destroy Destroying ProtocolHandler ["http-nio2-127.0.0.1-auto-71"]
25-Jun-2022 08:53:53.763 INFO [main] org.apache.catalina.startup.LoggingBaseTest.setUp Starting test case [testEncodeRedirectURL11]
25-Jun-2022 08:53:53.764 INFO [main] org.apache.coyote.AbstractProtocol.destroy Destroying ProtocolHandler ["http-nio2-127.0.0.1-auto-72"]
25-Jun-2022 08:53:53.764 INFO [main] org.apache.catalina.startup.LoggingBaseTest.setUp Starting test case [testEncodeRedirectURL12]
25-Jun-2022 08:53:53.765 INFO [main] org.apache.coyote.AbstractProtocol.destroy Destroying ProtocolHandler ["http-nio2-127.0.0.1-auto-73"]
25-Jun-2022 08:53:53.765 INFO [main] org.apache.catalina.startup.LoggingBaseTest.setUp Starting test case [testEncodeRedirectURL13]
25-Jun-2022 08:53:53.766 INFO [main] org.apache.coyote.AbstractProtocol.destroy Destroying ProtocolHandler ["http-nio2-127.0.0.1-auto-74"]
25-Jun-2022 08:53:53.766 INFO [main] org.apache.catalina.startup.LoggingBaseTest.setUp Starting test case [testEncodeRedirectURL14]
25-Jun-2022 08:53:53.767 INFO [main] org.apache.coyote.AbstractProtocol.destroy Destroying ProtocolHandler ["http-nio2-127.0.0.1-auto-75"]
25-Jun-2022 08:53:53.767 INFO [main] org.apache.catalina.startup.LoggingBaseTest.setUp Starting test case [testEncodeRedirectURL15]
25-Jun-2022 08:53:53.768 INFO [main] org.apache.coyote.AbstractProtocol.destroy Destroying ProtocolHandler ["http-nio2-127.0.0.1-auto-76"]
25-Jun-2022 08:53:53.768 INFO [main] org.apache.catalina.startup.LoggingBaseTest.setUp Starting test case [testEncodeRedirectURL16]
25-Jun-2022 08:53:53.769 INFO [main] org.apache.coyote.AbstractProtocol.destroy Destroying ProtocolHandler ["http-nio2-127.0.0.1-auto-77"]
------------- ---------------- ---------------

Testcase: testSendRedirect01 took 0.265 sec
Testcase: testSendRedirect02 took 0.002 sec
Testcase: testSendRedirect03 took 0.002 sec
Testcase: testSetLocale01 took 0.004 sec
Testcase: testSetLocale02 took 0.002 sec
Testcase: testSetLocale03 took 0.002 sec
Testcase: testSetLocale04 took 0.001 sec
Testcase: testSetLocale05 took 0.003 sec
Testcase: testSetLocale06 took 0.003 sec
Testcase: testSetLocale07 took 0.001 sec
Testcase: testSetLocale08 took 0.003 sec
Testcase: testBug49598 took 0.488 sec
Testcase: testBug52811 took 0.04 sec
Testcase: testSetContentType01 took 0.01 sec
Testcase: testSetContentType02 took 0.001 sec
Testcase: testSetContentType03 took 0.003 sec
Testcase: testSetContentType04 took 0.001 sec
Testcase: testSetContentType05 took 0.002 sec
Testcase: testSetContentType06 took 0.002 sec
Testcase: testBug53062a took 0.003 sec
Testcase: testBug53062b took 0.001 sec
Testcase: testBug53062c took 0.001 sec
Testcase: testBug53062d took 0.001 sec
Testcase: testBug53062e took 0.001 sec
Testcase: testBug53062f took 0.001 sec
Testcase: testBug53062g took 0.001 sec
Testcase: testBug53062h took 0.001 sec
Testcase: testBug53062i took 0.001 sec
Testcase: testBug53062j took 0.001 sec
Testcase: testBug53062k took 0.001 sec
Testcase: testBug53062l took 0.001 sec
Testcase: testBug53062m took 0.001 sec
Testcase: testBug53062n took 0.001 sec
Testcase: testBug53062o took 0.001 sec
Testcase: testBug53062p took 0 sec
Testcase: testBug53469a took 0 sec
Testcase: testBug53469b took 0 sec
Testcase: testCharset took 0.032 sec
Testcase: testSetCharacterEncoding01 took 0.001 sec
Testcase: testSetCharacterEncoding02 took 0.001 sec
Testcase: testSetCharacterEncoding03 took 0 sec
Testcase: testSetCharacterEncoding04 took 0.001 sec
Testcase: testSetCharacterEncoding05 took 0.001 sec
Testcase: testSetCharacterEncoding06 took 0.001 sec
Testcase: testSetCharacterEncoding07 took 0.002 sec
Testcase: testSetCharacterEncoding08 took 0.001 sec
Testcase: testEncodeURL01 took 0.001 sec
Testcase: testEncodeURL02 took 0.001 sec
Testcase: testEncodeURL03 took 0.001 sec
Testcase: testEncodeURL04 took 0.001 sec
Testcase: testEncodeURL06 took 0.001 sec
Testcase: testEncodeURL07 took 0.001 sec
Testcase: testEncodeURL08 took 0.001 sec
Testcase: testEncodeURL09 took 0.001 sec
Testcase: testEncodeURL10 took 0.001 sec
Testcase: testEncodeURL11 took 0.001 sec
Testcase: testEncodeURL12 took 0.001 sec
Testcase: testEncodeURL13 took 0.001 sec
Testcase: testEncodeURL14 took 0.001 sec
Testcase: testEncodeURL15 took 0 sec
Testcase: testEncodeURL16 took 0 sec
Testcase: testEncodeRedirectURL01 took 0.001 sec
Testcase: testEncodeRedirectURL02 took 0.001 sec
Testcase: testEncodeRedirectURL03 took 0.001 sec
Testcase: testEncodeRedirectURL04 took 0.001 sec
Testcase: testEncodeRedirectURL05 took 0.001 sec
Testcase: testEncodeRedirectURL06 took 0.001 sec
Testcase: testEncodeRedirectURL07 took 0.001 sec
Testcase: testEncodeRedirectURL08 took 0.001 sec
Testcase: testEncodeRedirectURL09 took 0.001 sec
Testcase: testEncodeRedirectURL10 took 0.001 sec
Testcase: testEncodeRedirectURL11 took 0.001 sec
Testcase: testEncodeRedirectURL12 took 0.001 sec
Testcase: testEncodeRedirectURL13 took 0.001 sec
Testcase: testEncodeRedirectURL14 took 0.001 sec
Testcase: testEncodeRedirectURL15 took 0.001 sec
Testcase: testEncodeRedirectURL16 took 0.001 sec

Apache Gump, Gump, Apache, the Apache feather logo, and the Apache Gump project logos are trademarks of The Apache Software Foundation.

Last Updated: Sat, 25 Jun 2022 06:00:06 ().Python Logo