Run| Workspace| Log| Issues| Fixes| Pre-reqs| Stats| XRef| Maven Repository Proxy Log Gump Logo

Details

File Contents

Testsuite: org.apache.catalina.connector.TestConnector
Tests run: 12, Failures: 0, Errors: 0, Skipped: 0, Time elapsed: 1.961 sec
------------- Standard Error -----------------
25-Jun-2022 08:53:34.147 INFO [main] org.apache.catalina.startup.LoggingBaseTest.setUp Starting test case [testTraceAllowedCustom]
25-Jun-2022 08:53:34.531 INFO [main] org.apache.coyote.AbstractProtocol.init Initializing ProtocolHandler ["http-nio2-127.0.0.1-auto-1"]
25-Jun-2022 08:53:34.564 INFO [main] org.apache.catalina.core.StandardService.startInternal Starting service [Tomcat]
25-Jun-2022 08:53:34.564 INFO [main] org.apache.catalina.core.StandardEngine.startInternal Starting Servlet engine: [Apache Tomcat/10.0.23-dev]
25-Jun-2022 08:53:34.672 INFO [main] org.apache.coyote.AbstractProtocol.start Starting ProtocolHandler ["http-nio2-127.0.0.1-auto-1-41105"]
25-Jun-2022 08:53:34.732 INFO [main] org.apache.coyote.AbstractProtocol.pause Pausing ProtocolHandler ["http-nio2-127.0.0.1-auto-1-41105"]
25-Jun-2022 08:53:34.734 INFO [main] org.apache.catalina.core.StandardService.stopInternal Stopping service [Tomcat]
25-Jun-2022 08:53:34.743 INFO [main] org.apache.coyote.AbstractProtocol.stop Stopping ProtocolHandler ["http-nio2-127.0.0.1-auto-1-41105"]
25-Jun-2022 08:53:34.744 INFO [main] org.apache.coyote.AbstractProtocol.destroy Destroying ProtocolHandler ["http-nio2-127.0.0.1-auto-1-41105"]
25-Jun-2022 08:53:34.753 INFO [main] org.apache.catalina.startup.LoggingBaseTest.setUp Starting test case [testTraceAllowedWebDav]
25-Jun-2022 08:53:34.760 INFO [main] org.apache.coyote.AbstractProtocol.init Initializing ProtocolHandler ["http-nio2-127.0.0.1-auto-2"]
25-Jun-2022 08:53:34.776 INFO [main] org.apache.catalina.core.StandardService.startInternal Starting service [Tomcat]
25-Jun-2022 08:53:34.776 INFO [main] org.apache.catalina.core.StandardEngine.startInternal Starting Servlet engine: [Apache Tomcat/10.0.23-dev]
25-Jun-2022 08:53:34.782 INFO [main] org.apache.coyote.AbstractProtocol.start Starting ProtocolHandler ["http-nio2-127.0.0.1-auto-2-33863"]
25-Jun-2022 08:53:34.787 INFO [main] org.apache.coyote.AbstractProtocol.pause Pausing ProtocolHandler ["http-nio2-127.0.0.1-auto-2-33863"]
25-Jun-2022 08:53:34.788 INFO [main] org.apache.catalina.core.StandardService.stopInternal Stopping service [Tomcat]
25-Jun-2022 08:53:34.790 INFO [main] org.apache.coyote.AbstractProtocol.stop Stopping ProtocolHandler ["http-nio2-127.0.0.1-auto-2-33863"]
25-Jun-2022 08:53:34.790 INFO [main] org.apache.coyote.AbstractProtocol.destroy Destroying ProtocolHandler ["http-nio2-127.0.0.1-auto-2-33863"]
25-Jun-2022 08:53:34.793 INFO [main] org.apache.catalina.startup.LoggingBaseTest.setUp Starting test case [testDuplicatePortNoThrows]
25-Jun-2022 08:53:34.796 INFO [main] org.apache.coyote.AbstractProtocol.init Initializing ProtocolHandler ["http-nio-auto-3"]
25-Jun-2022 08:53:34.799 INFO [main] org.apache.coyote.AbstractProtocol.start Starting ProtocolHandler ["http-nio-auto-3-35923"]
25-Jun-2022 08:53:34.806 WARNING [main] org.apache.tomcat.util.net.AbstractEndpoint.getUtilityExecutor No utility executor was set, creating one
25-Jun-2022 08:53:34.807 INFO [main] org.apache.coyote.AbstractProtocol.init Initializing ProtocolHandler ["http-nio-35923"]
25-Jun-2022 08:53:34.808 SEVERE [main] org.apache.catalina.util.LifecycleBase.handleSubClassException Failed to initialize component [Connector[HTTP/1.1-35923]]
	org.apache.catalina.LifecycleException: Protocol handler initialization failed
		at org.apache.catalina.connector.Connector.initInternal(Connector.java:1055)
		at org.apache.catalina.util.LifecycleBase.init(LifecycleBase.java:136)
		at org.apache.catalina.util.LifecycleBase.start(LifecycleBase.java:173)
		at org.apache.catalina.connector.TestConnector.doTestDuplicatePort(TestConnector.java:146)
		at org.apache.catalina.connector.TestConnector.testDuplicatePortNoThrows(TestConnector.java:132)
		at java.base/jdk.internal.reflect.NativeMethodAccessorImpl.invoke0(Native Method)
		at java.base/jdk.internal.reflect.NativeMethodAccessorImpl.invoke(NativeMethodAccessorImpl.java:62)
		at java.base/jdk.internal.reflect.DelegatingMethodAccessorImpl.invoke(DelegatingMethodAccessorImpl.java:43)
		at java.base/java.lang.reflect.Method.invoke(Method.java:566)
		at org.junit.runners.model.FrameworkMethod$1.runReflectiveCall(FrameworkMethod.java:59)
		at org.junit.internal.runners.model.ReflectiveCallable.run(ReflectiveCallable.java:12)
		at org.junit.runners.model.FrameworkMethod.invokeExplosively(FrameworkMethod.java:61)
		at org.junit.internal.runners.statements.InvokeMethod.evaluate(InvokeMethod.java:17)
		at org.junit.internal.runners.statements.RunBefores.evaluate(RunBefores.java:26)
		at org.junit.internal.runners.statements.RunAfters.evaluate(RunAfters.java:27)
		at org.junit.rules.TestWatcher$1.evaluate(TestWatcher.java:61)
		at org.junit.runners.ParentRunner$3.evaluate(ParentRunner.java:306)
		at org.junit.runners.BlockJUnit4ClassRunner$1.evaluate(BlockJUnit4ClassRunner.java:100)
		at org.junit.runners.ParentRunner.runLeaf(ParentRunner.java:366)
		at org.junit.runners.BlockJUnit4ClassRunner.runChild(BlockJUnit4ClassRunner.java:103)
		at org.junit.runners.BlockJUnit4ClassRunner.runChild(BlockJUnit4ClassRunner.java:63)
		at org.junit.runners.ParentRunner$4.run(ParentRunner.java:331)
		at org.junit.runners.ParentRunner$1.schedule(ParentRunner.java:79)
		at org.junit.runners.ParentRunner.runChildren(ParentRunner.java:329)
		at org.junit.runners.ParentRunner.access$100(ParentRunner.java:66)
		at org.junit.runners.ParentRunner$2.evaluate(ParentRunner.java:293)
		at org.junit.internal.runners.statements.RunBefores.evaluate(RunBefores.java:26)
		at org.junit.internal.runners.statements.RunAfters.evaluate(RunAfters.java:27)
		at org.junit.runners.ParentRunner$3.evaluate(ParentRunner.java:306)
		at org.junit.runners.ParentRunner.run(ParentRunner.java:413)
		at junit.framework.JUnit4TestAdapter.run(JUnit4TestAdapter.java:50)
		at org.apache.tools.ant.taskdefs.optional.junit.JUnitTestRunner.run(JUnitTestRunner.java:535)
		at org.apache.tools.ant.taskdefs.optional.junit.JUnitTestRunner.launch(JUnitTestRunner.java:1197)
		at org.apache.tools.ant.taskdefs.optional.junit.JUnitTestRunner.main(JUnitTestRunner.java:1042)
	Caused by: java.net.BindException: Address already in use
		at java.base/sun.nio.ch.Net.bind0(Native Method)
		at java.base/sun.nio.ch.Net.bind(Net.java:459)
		at java.base/sun.nio.ch.Net.bind(Net.java:448)
		at java.base/sun.nio.ch.ServerSocketChannelImpl.bind(ServerSocketChannelImpl.java:227)
		at org.apache.tomcat.util.net.NioEndpoint.initServerSocket(NioEndpoint.java:246)
		at org.apache.tomcat.util.net.NioEndpoint.bind(NioEndpoint.java:201)
		at org.apache.tomcat.util.net.AbstractEndpoint.bindWithCleanup(AbstractEndpoint.java:1192)
		at org.apache.tomcat.util.net.AbstractEndpoint.init(AbstractEndpoint.java:1205)
		at org.apache.coyote.AbstractProtocol.init(AbstractProtocol.java:580)
		at org.apache.coyote.http11.AbstractHttp11Protocol.init(AbstractHttp11Protocol.java:82)
		at org.apache.catalina.connector.Connector.initInternal(Connector.java:1052)
		... 33 more
25-Jun-2022 08:53:34.809 INFO [main] org.apache.coyote.AbstractProtocol.start Starting ProtocolHandler ["http-nio-35923"]
25-Jun-2022 08:53:34.809 SEVERE [main] org.apache.catalina.util.LifecycleBase.handleSubClassException Failed to start component [Connector[HTTP/1.1-35923]]
	org.apache.catalina.LifecycleException: Protocol handler start failed
		at org.apache.catalina.connector.Connector.startInternal(Connector.java:1081)
		at org.apache.catalina.util.LifecycleBase.start(LifecycleBase.java:183)
		at org.apache.catalina.connector.TestConnector.doTestDuplicatePort(TestConnector.java:146)
		at org.apache.catalina.connector.TestConnector.testDuplicatePortNoThrows(TestConnector.java:132)
		at java.base/jdk.internal.reflect.NativeMethodAccessorImpl.invoke0(Native Method)
		at java.base/jdk.internal.reflect.NativeMethodAccessorImpl.invoke(NativeMethodAccessorImpl.java:62)
		at java.base/jdk.internal.reflect.DelegatingMethodAccessorImpl.invoke(DelegatingMethodAccessorImpl.java:43)
		at java.base/java.lang.reflect.Method.invoke(Method.java:566)
		at org.junit.runners.model.FrameworkMethod$1.runReflectiveCall(FrameworkMethod.java:59)
		at org.junit.internal.runners.model.ReflectiveCallable.run(ReflectiveCallable.java:12)
		at org.junit.runners.model.FrameworkMethod.invokeExplosively(FrameworkMethod.java:61)
		at org.junit.internal.runners.statements.InvokeMethod.evaluate(InvokeMethod.java:17)
		at org.junit.internal.runners.statements.RunBefores.evaluate(RunBefores.java:26)
		at org.junit.internal.runners.statements.RunAfters.evaluate(RunAfters.java:27)
		at org.junit.rules.TestWatcher$1.evaluate(TestWatcher.java:61)
		at org.junit.runners.ParentRunner$3.evaluate(ParentRunner.java:306)
		at org.junit.runners.BlockJUnit4ClassRunner$1.evaluate(BlockJUnit4ClassRunner.java:100)
		at org.junit.runners.ParentRunner.runLeaf(ParentRunner.java:366)
		at org.junit.runners.BlockJUnit4ClassRunner.runChild(BlockJUnit4ClassRunner.java:103)
		at org.junit.runners.BlockJUnit4ClassRunner.runChild(BlockJUnit4ClassRunner.java:63)
		at org.junit.runners.ParentRunner$4.run(ParentRunner.java:331)
		at org.junit.runners.ParentRunner$1.schedule(ParentRunner.java:79)
		at org.junit.runners.ParentRunner.runChildren(ParentRunner.java:329)
		at org.junit.runners.ParentRunner.access$100(ParentRunner.java:66)
		at org.junit.runners.ParentRunner$2.evaluate(ParentRunner.java:293)
		at org.junit.internal.runners.statements.RunBefores.evaluate(RunBefores.java:26)
		at org.junit.internal.runners.statements.RunAfters.evaluate(RunAfters.java:27)
		at org.junit.runners.ParentRunner$3.evaluate(ParentRunner.java:306)
		at org.junit.runners.ParentRunner.run(ParentRunner.java:413)
		at junit.framework.JUnit4TestAdapter.run(JUnit4TestAdapter.java:50)
		at org.apache.tools.ant.taskdefs.optional.junit.JUnitTestRunner.run(JUnitTestRunner.java:535)
		at org.apache.tools.ant.taskdefs.optional.junit.JUnitTestRunner.launch(JUnitTestRunner.java:1197)
		at org.apache.tools.ant.taskdefs.optional.junit.JUnitTestRunner.main(JUnitTestRunner.java:1042)
	Caused by: java.net.BindException: Address already in use
		at java.base/sun.nio.ch.Net.bind0(Native Method)
		at java.base/sun.nio.ch.Net.bind(Net.java:459)
		at java.base/sun.nio.ch.Net.bind(Net.java:448)
		at java.base/sun.nio.ch.ServerSocketChannelImpl.bind(ServerSocketChannelImpl.java:227)
		at org.apache.tomcat.util.net.NioEndpoint.initServerSocket(NioEndpoint.java:246)
		at org.apache.tomcat.util.net.NioEndpoint.bind(NioEndpoint.java:201)
		at org.apache.tomcat.util.net.AbstractEndpoint.bindWithCleanup(AbstractEndpoint.java:1192)
		at org.apache.tomcat.util.net.AbstractEndpoint.start(AbstractEndpoint.java:1278)
		at org.apache.coyote.AbstractProtocol.start(AbstractProtocol.java:591)
		at org.apache.catalina.connector.Connector.startInternal(Connector.java:1078)
		... 32 more
25-Jun-2022 08:53:34.810 INFO [main] org.apache.coyote.AbstractProtocol.destroy Destroying ProtocolHandler ["http-nio2-127.0.0.1-auto-4"]
25-Jun-2022 08:53:34.810 INFO [main] org.apache.catalina.startup.LoggingBaseTest.setUp Starting test case [testTraceNotAllowedDefault]
25-Jun-2022 08:53:34.812 INFO [main] org.apache.coyote.AbstractProtocol.init Initializing ProtocolHandler ["http-nio2-127.0.0.1-auto-5"]
25-Jun-2022 08:53:34.813 INFO [main] org.apache.catalina.core.StandardService.startInternal Starting service [Tomcat]
25-Jun-2022 08:53:34.813 INFO [main] org.apache.catalina.core.StandardEngine.startInternal Starting Servlet engine: [Apache Tomcat/10.0.23-dev]
25-Jun-2022 08:53:34.824 INFO [main] org.apache.coyote.AbstractProtocol.start Starting ProtocolHandler ["http-nio2-127.0.0.1-auto-5-35075"]
25-Jun-2022 08:53:34.827 INFO [main] org.apache.coyote.AbstractProtocol.pause Pausing ProtocolHandler ["http-nio2-127.0.0.1-auto-5-35075"]
25-Jun-2022 08:53:34.827 INFO [main] org.apache.catalina.core.StandardService.stopInternal Stopping service [Tomcat]
25-Jun-2022 08:53:34.829 INFO [main] org.apache.coyote.AbstractProtocol.stop Stopping ProtocolHandler ["http-nio2-127.0.0.1-auto-5-35075"]
25-Jun-2022 08:53:34.830 INFO [main] org.apache.coyote.AbstractProtocol.destroy Destroying ProtocolHandler ["http-nio2-127.0.0.1-auto-5-35075"]
25-Jun-2022 08:53:34.833 INFO [main] org.apache.catalina.startup.LoggingBaseTest.setUp Starting test case [testTraceAllowedDefault]
25-Jun-2022 08:53:34.834 INFO [main] org.apache.coyote.AbstractProtocol.init Initializing ProtocolHandler ["http-nio2-127.0.0.1-auto-6"]
25-Jun-2022 08:53:34.836 INFO [main] org.apache.catalina.core.StandardService.startInternal Starting service [Tomcat]
25-Jun-2022 08:53:34.836 INFO [main] org.apache.catalina.core.StandardEngine.startInternal Starting Servlet engine: [Apache Tomcat/10.0.23-dev]
25-Jun-2022 08:53:34.841 INFO [main] org.apache.coyote.AbstractProtocol.start Starting ProtocolHandler ["http-nio2-127.0.0.1-auto-6-40579"]
25-Jun-2022 08:53:34.846 INFO [main] org.apache.coyote.AbstractProtocol.pause Pausing ProtocolHandler ["http-nio2-127.0.0.1-auto-6-40579"]
25-Jun-2022 08:53:34.847 INFO [main] org.apache.catalina.core.StandardService.stopInternal Stopping service [Tomcat]
25-Jun-2022 08:53:34.849 INFO [main] org.apache.coyote.AbstractProtocol.stop Stopping ProtocolHandler ["http-nio2-127.0.0.1-auto-6-40579"]
25-Jun-2022 08:53:34.850 INFO [main] org.apache.coyote.AbstractProtocol.destroy Destroying ProtocolHandler ["http-nio2-127.0.0.1-auto-6-40579"]
25-Jun-2022 08:53:34.857 INFO [main] org.apache.catalina.startup.LoggingBaseTest.setUp Starting test case [testPort]
25-Jun-2022 08:53:34.858 INFO [main] org.apache.coyote.AbstractProtocol.init Initializing ProtocolHandler ["http-nio2-127.0.0.1-auto-7"]
25-Jun-2022 08:53:34.860 INFO [main] org.apache.coyote.AbstractProtocol.init Initializing ProtocolHandler ["http-nio-auto-8"]
25-Jun-2022 08:53:34.860 INFO [main] org.apache.catalina.core.StandardService.startInternal Starting service [Tomcat]
25-Jun-2022 08:53:34.860 INFO [main] org.apache.catalina.core.StandardEngine.startInternal Starting Servlet engine: [Apache Tomcat/10.0.23-dev]
25-Jun-2022 08:53:34.861 INFO [main] org.apache.coyote.AbstractProtocol.start Starting ProtocolHandler ["http-nio2-127.0.0.1-auto-7-37021"]
25-Jun-2022 08:53:34.861 INFO [main] org.apache.coyote.AbstractProtocol.start Starting ProtocolHandler ["http-nio-auto-8-37581"]
25-Jun-2022 08:53:34.863 INFO [main] org.apache.coyote.AbstractProtocol.pause Pausing ProtocolHandler ["http-nio2-127.0.0.1-auto-7-37021"]
25-Jun-2022 08:53:34.864 INFO [main] org.apache.coyote.AbstractProtocol.pause Pausing ProtocolHandler ["http-nio-auto-8-37581"]
25-Jun-2022 08:53:34.865 INFO [main] org.apache.catalina.core.StandardService.stopInternal Stopping service [Tomcat]
25-Jun-2022 08:53:34.865 INFO [main] org.apache.coyote.AbstractProtocol.stop Stopping ProtocolHandler ["http-nio2-127.0.0.1-auto-7-37021"]
25-Jun-2022 08:53:34.865 INFO [main] org.apache.coyote.AbstractProtocol.stop Stopping ProtocolHandler ["http-nio-auto-8-37581"]
25-Jun-2022 08:53:34.867 INFO [main] org.apache.coyote.AbstractProtocol.destroy Destroying ProtocolHandler ["http-nio2-127.0.0.1-auto-7-37021"]
25-Jun-2022 08:53:34.869 INFO [main] org.apache.coyote.AbstractProtocol.destroy Destroying ProtocolHandler ["http-nio-auto-8-37581"]
25-Jun-2022 08:53:34.870 INFO [main] org.apache.catalina.startup.LoggingBaseTest.setUp Starting test case [testStop]
25-Jun-2022 08:53:34.871 INFO [main] org.apache.coyote.AbstractProtocol.init Initializing ProtocolHandler ["http-nio2-127.0.0.1-auto-9"]
25-Jun-2022 08:53:34.873 INFO [main] org.apache.catalina.core.StandardService.startInternal Starting service [Tomcat]
25-Jun-2022 08:53:34.873 INFO [main] org.apache.catalina.core.StandardEngine.startInternal Starting Servlet engine: [Apache Tomcat/10.0.23-dev]
25-Jun-2022 08:53:34.876 INFO [main] org.apache.coyote.AbstractProtocol.start Starting ProtocolHandler ["http-nio2-127.0.0.1-auto-9-44217"]
25-Jun-2022 08:53:34.882 INFO [main] org.apache.coyote.AbstractProtocol.stop Stopping ProtocolHandler ["http-nio2-127.0.0.1-auto-9-44217"]
25-Jun-2022 08:53:35.885 INFO [main] org.apache.coyote.AbstractProtocol.pause Pausing ProtocolHandler ["http-nio2-127.0.0.1-auto-9-44217"]
25-Jun-2022 08:53:35.885 INFO [main] org.apache.catalina.core.StandardService.stopInternal Stopping service [Tomcat]
25-Jun-2022 08:53:35.889 INFO [main] org.apache.coyote.AbstractProtocol.destroy Destroying ProtocolHandler ["http-nio2-127.0.0.1-auto-9-44217"]
25-Jun-2022 08:53:35.896 INFO [main] org.apache.catalina.startup.LoggingBaseTest.setUp Starting test case [testInvalidProtocolNoThrows]
25-Jun-2022 08:53:35.897 SEVERE [main] org.apache.catalina.connector.Connector.<init> Protocol handler instantiation failed
	java.lang.ClassNotFoundException: foo.Bar
		at java.base/jdk.internal.loader.BuiltinClassLoader.loadClass(BuiltinClassLoader.java:581)
		at java.base/jdk.internal.loader.ClassLoaders$AppClassLoader.loadClass(ClassLoaders.java:178)
		at java.base/java.lang.ClassLoader.loadClass(ClassLoader.java:522)
		at java.base/java.lang.Class.forName0(Native Method)
		at java.base/java.lang.Class.forName(Class.java:315)
		at org.apache.coyote.ProtocolHandler.create(ProtocolHandler.java:246)
		at org.apache.catalina.connector.Connector.<init>(Connector.java:78)
		at org.apache.catalina.connector.TestConnector.doTestInvalidProtocol(TestConnector.java:117)
		at org.apache.catalina.connector.TestConnector.testInvalidProtocolNoThrows(TestConnector.java:112)
		at java.base/jdk.internal.reflect.NativeMethodAccessorImpl.invoke0(Native Method)
		at java.base/jdk.internal.reflect.NativeMethodAccessorImpl.invoke(NativeMethodAccessorImpl.java:62)
		at java.base/jdk.internal.reflect.DelegatingMethodAccessorImpl.invoke(DelegatingMethodAccessorImpl.java:43)
		at java.base/java.lang.reflect.Method.invoke(Method.java:566)
		at org.junit.runners.model.FrameworkMethod$1.runReflectiveCall(FrameworkMethod.java:59)
		at org.junit.internal.runners.model.ReflectiveCallable.run(ReflectiveCallable.java:12)
		at org.junit.runners.model.FrameworkMethod.invokeExplosively(FrameworkMethod.java:61)
		at org.junit.internal.runners.statements.InvokeMethod.evaluate(InvokeMethod.java:17)
		at org.junit.internal.runners.statements.RunBefores.evaluate(RunBefores.java:26)
		at org.junit.internal.runners.statements.RunAfters.evaluate(RunAfters.java:27)
		at org.junit.rules.TestWatcher$1.evaluate(TestWatcher.java:61)
		at org.junit.runners.ParentRunner$3.evaluate(ParentRunner.java:306)
		at org.junit.runners.BlockJUnit4ClassRunner$1.evaluate(BlockJUnit4ClassRunner.java:100)
		at org.junit.runners.ParentRunner.runLeaf(ParentRunner.java:366)
		at org.junit.runners.BlockJUnit4ClassRunner.runChild(BlockJUnit4ClassRunner.java:103)
		at org.junit.runners.BlockJUnit4ClassRunner.runChild(BlockJUnit4ClassRunner.java:63)
		at org.junit.runners.ParentRunner$4.run(ParentRunner.java:331)
		at org.junit.runners.ParentRunner$1.schedule(ParentRunner.java:79)
		at org.junit.runners.ParentRunner.runChildren(ParentRunner.java:329)
		at org.junit.runners.ParentRunner.access$100(ParentRunner.java:66)
		at org.junit.runners.ParentRunner$2.evaluate(ParentRunner.java:293)
		at org.junit.internal.runners.statements.RunBefores.evaluate(RunBefores.java:26)
		at org.junit.internal.runners.statements.RunAfters.evaluate(RunAfters.java:27)
		at org.junit.runners.ParentRunner$3.evaluate(ParentRunner.java:306)
		at org.junit.runners.ParentRunner.run(ParentRunner.java:413)
		at junit.framework.JUnit4TestAdapter.run(JUnit4TestAdapter.java:50)
		at org.apache.tools.ant.taskdefs.optional.junit.JUnitTestRunner.run(JUnitTestRunner.java:535)
		at org.apache.tools.ant.taskdefs.optional.junit.JUnitTestRunner.launch(JUnitTestRunner.java:1197)
		at org.apache.tools.ant.taskdefs.optional.junit.JUnitTestRunner.main(JUnitTestRunner.java:1042)

Continuation...

25-Jun-2022 08:53:35.897 SEVERE [main] org.apache.catalina.util.LifecycleBase.handleSubClassException Failed to initialize component [Connector[foo.Bar-auto-null]]
	org.apache.catalina.LifecycleException: Protocol handler instantiation failed
		at org.apache.catalina.connector.Connector.initInternal(Connector.java:1017)
		at org.apache.catalina.util.LifecycleBase.init(LifecycleBase.java:136)
		at org.apache.catalina.util.LifecycleBase.start(LifecycleBase.java:173)
		at org.apache.catalina.connector.TestConnector.doTestInvalidProtocol(TestConnector.java:120)
		at org.apache.catalina.connector.TestConnector.testInvalidProtocolNoThrows(TestConnector.java:112)
		at java.base/jdk.internal.reflect.NativeMethodAccessorImpl.invoke0(Native Method)
		at java.base/jdk.internal.reflect.NativeMethodAccessorImpl.invoke(NativeMethodAccessorImpl.java:62)
		at java.base/jdk.internal.reflect.DelegatingMethodAccessorImpl.invoke(DelegatingMethodAccessorImpl.java:43)
		at java.base/java.lang.reflect.Method.invoke(Method.java:566)
		at org.junit.runners.model.FrameworkMethod$1.runReflectiveCall(FrameworkMethod.java:59)
		at org.junit.internal.runners.model.ReflectiveCallable.run(ReflectiveCallable.java:12)
		at org.junit.runners.model.FrameworkMethod.invokeExplosively(FrameworkMethod.java:61)
		at org.junit.internal.runners.statements.InvokeMethod.evaluate(InvokeMethod.java:17)
		at org.junit.internal.runners.statements.RunBefores.evaluate(RunBefores.java:26)
		at org.junit.internal.runners.statements.RunAfters.evaluate(RunAfters.java:27)
		at org.junit.rules.TestWatcher$1.evaluate(TestWatcher.java:61)
		at org.junit.runners.ParentRunner$3.evaluate(ParentRunner.java:306)
		at org.junit.runners.BlockJUnit4ClassRunner$1.evaluate(BlockJUnit4ClassRunner.java:100)
		at org.junit.runners.ParentRunner.runLeaf(ParentRunner.java:366)
		at org.junit.runners.BlockJUnit4ClassRunner.runChild(BlockJUnit4ClassRunner.java:103)
		at org.junit.runners.BlockJUnit4ClassRunner.runChild(BlockJUnit4ClassRunner.java:63)
		at org.junit.runners.ParentRunner$4.run(ParentRunner.java:331)
		at org.junit.runners.ParentRunner$1.schedule(ParentRunner.java:79)
		at org.junit.runners.ParentRunner.runChildren(ParentRunner.java:329)
		at org.junit.runners.ParentRunner.access$100(ParentRunner.java:66)
		at org.junit.runners.ParentRunner$2.evaluate(ParentRunner.java:293)
		at org.junit.internal.runners.statements.RunBefores.evaluate(RunBefores.java:26)
		at org.junit.internal.runners.statements.RunAfters.evaluate(RunAfters.java:27)
		at org.junit.runners.ParentRunner$3.evaluate(ParentRunner.java:306)
		at org.junit.runners.ParentRunner.run(ParentRunner.java:413)
		at junit.framework.JUnit4TestAdapter.run(JUnit4TestAdapter.java:50)
		at org.apache.tools.ant.taskdefs.optional.junit.JUnitTestRunner.run(JUnitTestRunner.java:535)
		at org.apache.tools.ant.taskdefs.optional.junit.JUnitTestRunner.launch(JUnitTestRunner.java:1197)
		at org.apache.tools.ant.taskdefs.optional.junit.JUnitTestRunner.main(JUnitTestRunner.java:1042)
25-Jun-2022 08:53:35.898 SEVERE [main] org.apache.catalina.util.LifecycleBase.handleSubClassException Failed to start component [Connector[foo.Bar-auto-null]]
	org.apache.catalina.LifecycleException: The connector cannot start since the specified port value of [-1] is invalid
		at org.apache.catalina.connector.Connector.startInternal(Connector.java:1071)
		at org.apache.catalina.util.LifecycleBase.start(LifecycleBase.java:183)
		at org.apache.catalina.connector.TestConnector.doTestInvalidProtocol(TestConnector.java:120)
		at org.apache.catalina.connector.TestConnector.testInvalidProtocolNoThrows(TestConnector.java:112)
		at java.base/jdk.internal.reflect.NativeMethodAccessorImpl.invoke0(Native Method)
		at java.base/jdk.internal.reflect.NativeMethodAccessorImpl.invoke(NativeMethodAccessorImpl.java:62)
		at java.base/jdk.internal.reflect.DelegatingMethodAccessorImpl.invoke(DelegatingMethodAccessorImpl.java:43)
		at java.base/java.lang.reflect.Method.invoke(Method.java:566)
		at org.junit.runners.model.FrameworkMethod$1.runReflectiveCall(FrameworkMethod.java:59)
		at org.junit.internal.runners.model.ReflectiveCallable.run(ReflectiveCallable.java:12)
		at org.junit.runners.model.FrameworkMethod.invokeExplosively(FrameworkMethod.java:61)
		at org.junit.internal.runners.statements.InvokeMethod.evaluate(InvokeMethod.java:17)
		at org.junit.internal.runners.statements.RunBefores.evaluate(RunBefores.java:26)
		at org.junit.internal.runners.statements.RunAfters.evaluate(RunAfters.java:27)
		at org.junit.rules.TestWatcher$1.evaluate(TestWatcher.java:61)
		at org.junit.runners.ParentRunner$3.evaluate(ParentRunner.java:306)
		at org.junit.runners.BlockJUnit4ClassRunner$1.evaluate(BlockJUnit4ClassRunner.java:100)
		at org.junit.runners.ParentRunner.runLeaf(ParentRunner.java:366)
		at org.junit.runners.BlockJUnit4ClassRunner.runChild(BlockJUnit4ClassRunner.java:103)
		at org.junit.runners.BlockJUnit4ClassRunner.runChild(BlockJUnit4ClassRunner.java:63)
		at org.junit.runners.ParentRunner$4.run(ParentRunner.java:331)
		at org.junit.runners.ParentRunner$1.schedule(ParentRunner.java:79)
		at org.junit.runners.ParentRunner.runChildren(ParentRunner.java:329)
		at org.junit.runners.ParentRunner.access$100(ParentRunner.java:66)
		at org.junit.runners.ParentRunner$2.evaluate(ParentRunner.java:293)
		at org.junit.internal.runners.statements.RunBefores.evaluate(RunBefores.java:26)
		at org.junit.internal.runners.statements.RunAfters.evaluate(RunAfters.java:27)
		at org.junit.runners.ParentRunner$3.evaluate(ParentRunner.java:306)
		at org.junit.runners.ParentRunner.run(ParentRunner.java:413)
		at junit.framework.JUnit4TestAdapter.run(JUnit4TestAdapter.java:50)
		at org.apache.tools.ant.taskdefs.optional.junit.JUnitTestRunner.run(JUnitTestRunner.java:535)
		at org.apache.tools.ant.taskdefs.optional.junit.JUnitTestRunner.launch(JUnitTestRunner.java:1197)
		at org.apache.tools.ant.taskdefs.optional.junit.JUnitTestRunner.main(JUnitTestRunner.java:1042)
25-Jun-2022 08:53:35.899 INFO [main] org.apache.coyote.AbstractProtocol.destroy Destroying ProtocolHandler ["http-nio2-127.0.0.1-auto-10"]
25-Jun-2022 08:53:35.899 INFO [main] org.apache.catalina.startup.LoggingBaseTest.setUp Starting test case [testTraceNotAllowedCustom]
25-Jun-2022 08:53:35.900 INFO [main] org.apache.coyote.AbstractProtocol.init Initializing ProtocolHandler ["http-nio2-127.0.0.1-auto-11"]
25-Jun-2022 08:53:35.905 INFO [main] org.apache.catalina.core.StandardService.startInternal Starting service [Tomcat]
25-Jun-2022 08:53:35.905 INFO [main] org.apache.catalina.core.StandardEngine.startInternal Starting Servlet engine: [Apache Tomcat/10.0.23-dev]
25-Jun-2022 08:53:35.910 INFO [main] org.apache.coyote.AbstractProtocol.start Starting ProtocolHandler ["http-nio2-127.0.0.1-auto-11-44025"]
25-Jun-2022 08:53:35.913 INFO [main] org.apache.coyote.AbstractProtocol.pause Pausing ProtocolHandler ["http-nio2-127.0.0.1-auto-11-44025"]
25-Jun-2022 08:53:35.917 INFO [main] org.apache.catalina.core.StandardService.stopInternal Stopping service [Tomcat]
25-Jun-2022 08:53:35.918 INFO [main] org.apache.coyote.AbstractProtocol.stop Stopping ProtocolHandler ["http-nio2-127.0.0.1-auto-11-44025"]
25-Jun-2022 08:53:35.919 INFO [main] org.apache.coyote.AbstractProtocol.destroy Destroying ProtocolHandler ["http-nio2-127.0.0.1-auto-11-44025"]
25-Jun-2022 08:53:35.921 INFO [main] org.apache.catalina.startup.LoggingBaseTest.setUp Starting test case [testTraceNotAllowedWebDav]
25-Jun-2022 08:53:35.923 INFO [main] org.apache.coyote.AbstractProtocol.init Initializing ProtocolHandler ["http-nio2-127.0.0.1-auto-12"]
25-Jun-2022 08:53:35.932 INFO [main] org.apache.catalina.core.StandardService.startInternal Starting service [Tomcat]
25-Jun-2022 08:53:35.932 INFO [main] org.apache.catalina.core.StandardEngine.startInternal Starting Servlet engine: [Apache Tomcat/10.0.23-dev]
25-Jun-2022 08:53:35.936 INFO [main] org.apache.coyote.AbstractProtocol.start Starting ProtocolHandler ["http-nio2-127.0.0.1-auto-12-42671"]
25-Jun-2022 08:53:35.942 INFO [main] org.apache.coyote.AbstractProtocol.pause Pausing ProtocolHandler ["http-nio2-127.0.0.1-auto-12-42671"]
25-Jun-2022 08:53:35.942 INFO [main] org.apache.catalina.core.StandardService.stopInternal Stopping service [Tomcat]
25-Jun-2022 08:53:35.944 INFO [main] org.apache.coyote.AbstractProtocol.stop Stopping ProtocolHandler ["http-nio2-127.0.0.1-auto-12-42671"]
25-Jun-2022 08:53:35.944 INFO [main] org.apache.coyote.AbstractProtocol.destroy Destroying ProtocolHandler ["http-nio2-127.0.0.1-auto-12-42671"]
25-Jun-2022 08:53:35.951 INFO [main] org.apache.catalina.startup.LoggingBaseTest.setUp Starting test case [testInvalidProtocolThrows]
25-Jun-2022 08:53:35.952 SEVERE [main] org.apache.catalina.connector.Connector.<init> Protocol handler instantiation failed
	java.lang.ClassNotFoundException: foo.Bar
		at java.base/jdk.internal.loader.BuiltinClassLoader.loadClass(BuiltinClassLoader.java:581)
		at java.base/jdk.internal.loader.ClassLoaders$AppClassLoader.loadClass(ClassLoaders.java:178)
		at java.base/java.lang.ClassLoader.loadClass(ClassLoader.java:522)
		at java.base/java.lang.Class.forName0(Native Method)
		at java.base/java.lang.Class.forName(Class.java:315)
		at org.apache.coyote.ProtocolHandler.create(ProtocolHandler.java:246)
		at org.apache.catalina.connector.Connector.<init>(Connector.java:78)
		at org.apache.catalina.connector.TestConnector.doTestInvalidProtocol(TestConnector.java:117)
		at org.apache.catalina.connector.TestConnector.testInvalidProtocolThrows(TestConnector.java:106)
		at java.base/jdk.internal.reflect.NativeMethodAccessorImpl.invoke0(Native Method)
		at java.base/jdk.internal.reflect.NativeMethodAccessorImpl.invoke(NativeMethodAccessorImpl.java:62)
		at java.base/jdk.internal.reflect.DelegatingMethodAccessorImpl.invoke(DelegatingMethodAccessorImpl.java:43)
		at java.base/java.lang.reflect.Method.invoke(Method.java:566)
		at org.junit.runners.model.FrameworkMethod$1.runReflectiveCall(FrameworkMethod.java:59)
		at org.junit.internal.runners.model.ReflectiveCallable.run(ReflectiveCallable.java:12)
		at org.junit.runners.model.FrameworkMethod.invokeExplosively(FrameworkMethod.java:61)
		at org.junit.internal.runners.statements.InvokeMethod.evaluate(InvokeMethod.java:17)
		at org.junit.internal.runners.statements.ExpectException.evaluate(ExpectException.java:19)
		at org.junit.internal.runners.statements.RunBefores.evaluate(RunBefores.java:26)
		at org.junit.internal.runners.statements.RunAfters.evaluate(RunAfters.java:27)
		at org.junit.rules.TestWatcher$1.evaluate(TestWatcher.java:61)
		at org.junit.runners.ParentRunner$3.evaluate(ParentRunner.java:306)
		at org.junit.runners.BlockJUnit4ClassRunner$1.evaluate(BlockJUnit4ClassRunner.java:100)
		at org.junit.runners.ParentRunner.runLeaf(ParentRunner.java:366)
		at org.junit.runners.BlockJUnit4ClassRunner.runChild(BlockJUnit4ClassRunner.java:103)
		at org.junit.runners.BlockJUnit4ClassRunner.runChild(BlockJUnit4ClassRunner.java:63)
		at org.junit.runners.ParentRunner$4.run(ParentRunner.java:331)
		at org.junit.runners.ParentRunner$1.schedule(ParentRunner.java:79)
		at org.junit.runners.ParentRunner.runChildren(ParentRunner.java:329)
		at org.junit.runners.ParentRunner.access$100(ParentRunner.java:66)
		at org.junit.runners.ParentRunner$2.evaluate(ParentRunner.java:293)
		at org.junit.internal.runners.statements.RunBefores.evaluate(RunBefores.java:26)
		at org.junit.internal.runners.statements.RunAfters.evaluate(RunAfters.java:27)
		at org.junit.runners.ParentRunner$3.evaluate(ParentRunner.java:306)
		at org.junit.runners.ParentRunner.run(ParentRunner.java:413)
		at junit.framework.JUnit4TestAdapter.run(JUnit4TestAdapter.java:50)
		at org.apache.tools.ant.taskdefs.optional.junit.JUnitTestRunner.run(JUnitTestRunner.java:535)
		at org.apache.tools.ant.taskdefs.optional.junit.JUnitTestRunner.launch(JUnitTestRunner.java:1197)
		at org.apache.tools.ant.taskdefs.optional.junit.JUnitTestRunner.main(JUnitTestRunner.java:1042)
25-Jun-2022 08:53:35.953 INFO [main] org.apache.coyote.AbstractProtocol.destroy Destroying ProtocolHandler ["http-nio2-127.0.0.1-auto-13"]
25-Jun-2022 08:53:35.954 INFO [main] org.apache.catalina.startup.LoggingBaseTest.setUp Starting test case [testDuplicatePortThrows]
25-Jun-2022 08:53:35.955 INFO [main] org.apache.coyote.AbstractProtocol.init Initializing ProtocolHandler ["http-nio-auto-14"]
25-Jun-2022 08:53:35.955 INFO [main] org.apache.coyote.AbstractProtocol.start Starting ProtocolHandler ["http-nio-auto-14-38457"]
25-Jun-2022 08:53:35.964 WARNING [main] org.apache.tomcat.util.net.AbstractEndpoint.getUtilityExecutor No utility executor was set, creating one
25-Jun-2022 08:53:35.965 INFO [main] org.apache.coyote.AbstractProtocol.init Initializing ProtocolHandler ["http-nio-38457"]
25-Jun-2022 08:53:35.965 INFO [main] org.apache.coyote.AbstractProtocol.destroy Destroying ProtocolHandler ["http-nio2-127.0.0.1-auto-15"]
------------- ---------------- ---------------

Testcase: testTraceAllowedCustom took 0.725 sec
Testcase: testTraceAllowedWebDav took 0.04 sec
Testcase: testDuplicatePortNoThrows took 0.017 sec
Testcase: testTraceNotAllowedDefault took 0.022 sec
Testcase: testTraceAllowedDefault took 0.025 sec
Testcase: testPort took 0.012 sec
Testcase: testStop took 1.025 sec
Testcase: testInvalidProtocolNoThrows took 0.003 sec
Testcase: testTraceNotAllowedCustom took 0.022 sec
Testcase: testTraceNotAllowedWebDav took 0.03 sec
Testcase: testInvalidProtocolThrows took 0.002 sec
Testcase: testDuplicatePortThrows took 0.013 sec

Apache Gump, Gump, Apache, the Apache feather logo, and the Apache Gump project logos are trademarks of The Apache Software Foundation.

Last Updated: Sat, 25 Jun 2022 06:00:06 ().Python Logo