Run| Workspace| Log| Issues| Fixes| Pre-reqs| Stats| XRef| Maven Repository Proxy Log Gump Logo

Details

Parameters

Prefix Name Value
-D java.awt.headless true
-D build.sysclasspath only
-X bootclasspath/p :/srv/gump/public/workspace/xml-xerces2/build/xercesImpl.jar /srv/gump/public/workspace/xml-commons/java/external/build/xml-apis.jar
org.apache.tools.ant.Main
-D gump.merge /srv/gump/public/gump/work/merge.xml
-D ant.home /srv/gump/public/workspace/ant/dist
test

Environment Overrides

Name Value
CLASSPATH :/usr/lib/jvm/java-8-oracle/lib/tools.jar /srv/gump/public/workspace/antlibs-compress/ivy/ivy.jar /srv/gump/public/workspace/antlibs-compress/build/ant-compress-20170324.jar /srv/gump/public/workspace/ant/dist/lib/ant.jar /srv/gump/public/workspace/ant/dist/lib/ant-launcher.jar /srv/gump/public/workspace/ant/dist/lib/ant-jmf.jar /srv/gump/public/workspace/ant/dist/lib/ant-junit.jar /srv/gump/public/workspace/ant/dist/lib/ant-junit4.jar /srv/gump/public/workspace/ant/dist/lib/ant-swing.jar /srv/gump/public/workspace/ant/dist/lib/ant-apache-resolver.jar /srv/gump/public/workspace/ant/dist/lib/ant-apache-xalan2.jar /srv/gump/public/workspace/commons-compress/target/commons-compress-1.14-SNAPSHOT.jar /srv/gump/public/workspace/xz-java/build/jar-20170324/xz.jar /srv/gump/public/workspace/antlibs-antunit/build/ant-antunit-20170324.jar /srv/gump/public/workspace/xml-commons/java/external/build/xml-apis-ext.jar

Command Line

/usr/lib/jvm/java-8-oracle/bin/java -Djava.awt.headless=true
        -Dbuild.sysclasspath=only
        -Xbootclasspath/p:/srv/gump/public/workspace/xml-xerces2/build/xercesImpl.jar:/srv/gump/public/workspace/xml-commons/java/external/build/xml-apis.jar
        org.apache.tools.ant.Main -Dgump.merge=/srv/gump/public/gump/work/merge.xml
        -Dant.home=/srv/gump/public/workspace/ant/dist test 

Output

Buildfile: /srv/gump/public/workspace/antlibs-compress/build.xml

setup-properties:

setup:

determine-test-types:

setup-for-junit-tests:

download-ivy:
     [echo] installing ivy...
      [get] Getting: http://repo1.maven.org/maven2/org/apache/ivy/ivy/2.4.0-rc1/ivy-2.4.0-rc1.jar
      [get] To: /srv/gump/public/workspace/antlibs-compress/ivy/ivy.jar
      [get] Not modified - so not downloaded

install-ivy:

-no-resolve:

resolve:
[ivy:resolve] :: Apache Ivy 2.4.0-rc1 - 20140315220245 :: http://ant.apache.org/ivy/ ::
[ivy:resolve] :: loading settings :: url = jar:file:/srv/gump/public/workspace/antlibs-compress/ivy/ivy.jar!/org/apache/ivy/core/settings/ivysettings.xml
[ivy:resolve] :: resolving dependencies :: Apache Ant#ant-compress;1.5Alpha
[ivy:resolve] 	confs: [default, test]
[ivy:resolve] 	found org.apache.commons#commons-compress;1.8 in public
[ivy:resolve] 	found org.tukaani#xz;1.5 in public
[ivy:resolve] 	found junit#junit;4.11 in public
[ivy:resolve] 	found org.hamcrest#hamcrest-core;1.3 in public
[ivy:resolve] :: resolution report :: resolve 202ms :: artifacts dl 6ms
	---------------------------------------------------------------------
	|                  |            modules            ||   artifacts   |
	|       conf       | number| search|dwnlded|evicted|| number|dwnlded|
	---------------------------------------------------------------------
	|      default     |   2   |   0   |   0   |   0   ||   2   |   0   |
	|       test       |   2   |   0   |   0   |   0   ||   2   |   0   |
	---------------------------------------------------------------------
[ivy:retrieve] :: retrieving :: Apache Ant#ant-compress [sync]
[ivy:retrieve] 	confs: [default]
[ivy:retrieve] 	0 artifacts copied, 2 already retrieved (0kB/9ms)
[ivy:retrieve] :: retrieving :: Apache Ant#ant-compress [sync]
[ivy:retrieve] 	confs: [test]
[ivy:retrieve] 	0 artifacts copied, 2 already retrieved (0kB/4ms)

compile:

check-for-NOTICE:

antlib:
      [jar] Building jar: /srv/gump/public/workspace/antlibs-compress/build/lib/ant-compress-1.5Alpha.jar

compile-tests:

ready-to-test-with-junit:

junit-test:

setup-for-antunit-tests:

ready-to-test-with-antunit:

antunit-test:
    [mkdir] Created dir: /srv/gump/public/workspace/antlibs-compress/build/reports/antunit
[au:antunit] Build File: /srv/gump/public/workspace/antlibs-compress/src/tests/antunit/ar-test.xml
[au:antunit] Tests run: 36, Failures: 2, Errors: 0, Time elapsed: 33.049 sec
[au:antunit] Target: testNonFileDest took 0.059 sec
[au:antunit] Target: testPrefixWithoutSlash took 0.03 sec
[au:antunit] Target: testCreateOfUpToDate took 4.032 sec
[au:antunit] Target: testArFileSet took 0.026 sec
[au:antunit] Target: testCpioFileSet took 0.054 sec
[au:antunit] Target: testPreserveDuplicates took 0.039 sec
[au:antunit] Target: testFailEmpty took 0.004 sec
[au:antunit] Target: testCoreTarFileSet took 0.039 sec
[au:antunit] Target: testPreserveLeadingSlashes took 0.034 sec
[au:antunit] Target: testAntlibZipFileSet  FAILED
[au:antunit] 	at line 37, column 24
[au:antunit] 	Message: Assertion failed
[au:antunit] 	took 0.031 sec
[au:antunit] Target: testPrefixWithBackslash took 0.014 sec
[au:antunit] Target: testLongNameBSD took 0.014 sec
[au:antunit] Target: testImplicitDirectoriesUsePermissions took 0.004 sec
[au:antunit] Target: testReplaceOfOutOfDate took 4.032 sec
[au:antunit] Target: testUpdateOfUpToDate took 4.026 sec
[au:antunit] Target: testUpdateOfOutOfDate took 4.056 sec
[au:antunit] Target: testSkipEmpty took 0.006 sec
[au:antunit] Target: testWithDirectories took 0.004 sec
[au:antunit] Target: testFullpath took 0.018 sec
[au:antunit] Target: testPreserve0Permissions took 0.018 sec
[au:antunit] Target: testForceCreateOfUpToDate took 4.035 sec
[au:antunit] Target: testNoDirectoriesByDefault took 0.022 sec
[au:antunit] Target: testPlainFileSet took 0.02 sec
[au:antunit] Target: testReplaceOfUpToDate took 4.015 sec
[au:antunit] Target: testCoreZipFileSet  FAILED
[au:antunit] 	at line 37, column 24
[au:antunit] 	Message: Assertion failed
[au:antunit] 	took 0.048 sec
[au:antunit] Target: testAntlibTarFileSet took 0.044 sec
[au:antunit] Target: testCreateOfOutOfDate took 4.033 sec
[au:antunit] Target: testFileSetPermissionsWin took 0.016 sec
[au:antunit] Target: testLongNameException took 0.005 sec
[au:antunit] Target: testAddDuplicates took 0.009 sec
[au:antunit] Target: testRemoveLeadingSlashes took 0.015 sec
[au:antunit] Target: testPrefixWithSlash took 0.016 sec
[au:antunit] Target: testWithImplicitDirectories took 0.004 sec
[au:antunit] Target: testForceReplaceOfUpToDate took 4.024 sec
[au:antunit] Target: test0PermissionsGetReplaced took 0.017 sec
[au:antunit] Target: testFailDuplicates took 0.004 sec
[au:antunit] Build File: /srv/gump/public/workspace/antlibs-compress/src/tests/antunit/archives-test.xml
[au:antunit] Tests run: 5, Failures: 0, Errors: 0, Time elapsed: 0.625 sec
[au:antunit] Target: testCircularReference took 0.008 sec
[au:antunit] Target: testReference took 0.038 sec
[au:antunit] Target: testExtractJars took 0.356 sec
[au:antunit] Target: testMixingFormats took 0.02 sec
[au:antunit] Target: testZipManualExample took 0.121 sec
[au:antunit] Build File: /srv/gump/public/workspace/antlibs-compress/src/tests/antunit/arentry-test.xml
[au:antunit] Tests run: 2, Failures: 0, Errors: 0, Time elapsed: 0.039 sec
[au:antunit] Target: testResourceProperties took 0.012 sec
[au:antunit] Target: testArSource took 0.003 sec
[au:antunit] Build File: /srv/gump/public/workspace/antlibs-compress/src/tests/antunit/arfileset-test.xml
[au:antunit] Tests run: 3, Failures: 0, Errors: 0, Time elapsed: 0.022 sec
[au:antunit] Target: testMissingArchive took 0.007 sec
[au:antunit] Target: testArSource took 0.006 sec
[au:antunit] Target: testMissingArchiveDoesntMatter took 0.003 sec
[au:antunit] Build File: /srv/gump/public/workspace/antlibs-compress/src/tests/antunit/arjentry-test.xml
[au:antunit] Tests run: 2, Failures: 0, Errors: 0, Time elapsed: 0.044 sec
[au:antunit] Target: testArjSource took 0.01 sec
[au:antunit] Target: testResourceProperties took 0.012 sec
[au:antunit] Build File: /srv/gump/public/workspace/antlibs-compress/src/tests/antunit/arjfileset-test.xml
[au:antunit] Tests run: 5, Failures: 0, Errors: 0, Time elapsed: 0.05 sec
[au:antunit] Target: testMissingArchive took 0.006 sec
[au:antunit] Target: testUncompressSource took 0.01 sec
[au:antunit] Target: test-refid-check-encoding took 0.004 sec
[au:antunit] Target: testArjSource took 0.007 sec
[au:antunit] Target: testMissingArchiveDoesntMatter took 0.003 sec
[au:antunit] Build File: /srv/gump/public/workspace/antlibs-compress/src/tests/antunit/bunzip2-test.xml
[au:antunit] Tests run: 8, Failures: 0, Errors: 0, Time elapsed: 0.415 sec
[au:antunit] Target: testCoreBzip2Task took 0.082 sec
[au:antunit] Target: testAntlibBzip2Task took 0.032 sec
[au:antunit] Target: testConcatenatedStreamsAllStreams took 0.005 sec
[au:antunit] Target: testWithResource took 0.013 sec
[au:antunit] Target: testHugeFile took 0.165 sec
[au:antunit] Target: testNativeBzip2 took 0.004 sec
[au:antunit] Target: testConcatenatedStreamsOnlyFirstStream took 0.004 sec
[au:antunit] Target: testConcatenatedStreamsDefault took 0.003 sec
[au:antunit] Build File: /srv/gump/public/workspace/antlibs-compress/src/tests/antunit/bzip2-test.xml
[au:antunit] Tests run: 9, Failures: 0, Errors: 0, Time elapsed: 1.173 sec
[au:antunit] Target: testDateCheck took 0.004 sec
[au:antunit] Target: testFailTwo took 0.003 sec
[au:antunit] Target: testRealTestWithResource took 0.023 sec
[au:antunit] Target: testFailTwoDests took 0.004 sec
[au:antunit] Target: testHugeFile took 0.979 sec
[au:antunit] Target: testFailNoDest took 0.003 sec
[au:antunit] Target: testFailNone took 0.003 sec
[au:antunit] Target: testNestedTask took 0.031 sec
[au:antunit] Target: testRealTest took 0.018 sec
[au:antunit] Build File: /srv/gump/public/workspace/antlibs-compress/src/tests/antunit/bzip2resource-test.xml
[au:antunit] Tests run: 4, Failures: 0, Errors: 0, Time elapsed: 0.067 sec
[au:antunit] Target: testConcatenatedStreamsAllStreams took 0.005 sec
[au:antunit] Target: testNativeBzip2 took 0.005 sec
[au:antunit] Target: testConcatenatedStreamsOnlyFirstStream took 0.004 sec
[au:antunit] Target: testConcatenatedStreamsDefault took 0.006 sec
[au:antunit] Build File: /srv/gump/public/workspace/antlibs-compress/src/tests/antunit/conditions-test.xml
[au:antunit] Tests run: 24, Failures: 0, Errors: 0, Time elapsed: 0.554 sec
[au:antunit] Target: testCoreTarHasUserId took 0.007 sec
[au:antunit] Target: testArHasUserId took 0.005 sec
[au:antunit] Target: testAntlibZipHasMode took 0.005 sec
[au:antunit] Target: testAntlibZipIsLastModified took 0.011 sec
[au:antunit] Target: testAntlibTarHasMode took 0.005 sec
[au:antunit] Target: testArIsLastModified took 0.011 sec
[au:antunit] Target: testArHasGroupId took 0.005 sec
[au:antunit] Target: testCoreZipIsLastModified took 0.01 sec
[au:antunit] Target: testCoreZipHasMode took 0.005 sec
[au:antunit] Target: testCoreTarHasUserName took 0.005 sec
[au:antunit] Target: testAntlibTarIsLastModified took 0.012 sec
[au:antunit] Target: testArHasMode took 0.005 sec
[au:antunit] Target: testAntlibTarHasGroupName took 0.006 sec
[au:antunit] Target: testCpioIsLastModified took 0.016 sec
[au:antunit] Target: testCoreTarHasGroupId took 0.009 sec
[au:antunit] Target: testCoreTarHasGroupName took 0.008 sec
[au:antunit] Target: testAntlibTarHasUserName took 0.007 sec
[au:antunit] Target: testCpioHasMode took 0.007 sec
[au:antunit] Target: testCoreTarHasMode took 0.007 sec
[au:antunit] Target: testAntlibTarHasUserId took 0.006 sec
[au:antunit] Target: testCpioHasGroupId took 0.006 sec
[au:antunit] Target: testCpioHasUserId took 0.005 sec
[au:antunit] Target: testAntlibTarHasGroupId took 0.004 sec
[au:antunit] Target: testCoreTarIsLastModified took 0.047 sec
[au:antunit] Build File: /srv/gump/public/workspace/antlibs-compress/src/tests/antunit/cpio-test.xml
[au:antunit] Tests run: 33, Failures: 2, Errors: 0, Time elapsed: 32.533 sec
[au:antunit] Target: testNonFileDest took 0.007 sec
[au:antunit] Target: testPrefixWithoutSlash took 0.015 sec
[au:antunit] Target: testCreateOfUpToDate took 4.011 sec
[au:antunit] Target: testArFileSet took 0.019 sec
[au:antunit] Target: testCpioFileSet took 0.01 sec
[au:antunit] Target: testPreserveDuplicates took 0.005 sec
[au:antunit] Target: testFailEmpty took 0.002 sec
[au:antunit] Target: testCoreTarFileSet took 0.011 sec
[au:antunit] Target: testPreserveLeadingSlashes took 0.009 sec
[au:antunit] Target: testAntlibZipFileSet  FAILED
[au:antunit] 	at line 37, column 24
[au:antunit] 	Message: Assertion failed
[au:antunit] 	took 0.012 sec
[au:antunit] Target: testPrefixWithBackslash took 0.009 sec
[au:antunit] Target: testImplicitDirectoriesUsePermissions took 0.003 sec
[au:antunit] Target: testReplaceOfOutOfDate took 4.018 sec
[au:antunit] Target: testUpdateOfUpToDate took 4.012 sec
[au:antunit] Target: testUpdateOfOutOfDate took 4.017 sec
[au:antunit] Target: testSkipEmpty took 0.003 sec
[au:antunit] Target: testWithDirectories took 0.01 sec
[au:antunit] Target: testFullpath took 0.009 sec
[au:antunit] Target: testPreserve0Permissions took 0.012 sec
[au:antunit] Target: testForceCreateOfUpToDate took 4.013 sec
[au:antunit] Target: testNoDirectoriesByDefault took 0.01 sec
[au:antunit] Target: testPlainFileSet took 0.01 sec
[au:antunit] Target: testReplaceOfUpToDate took 4.007 sec
[au:antunit] Target: testCoreZipFileSet  FAILED
[au:antunit] 	at line 37, column 24
[au:antunit] 	Message: Assertion failed
[au:antunit] 	took 0.014 sec
[au:antunit] Target: testAntlibTarFileSet took 0.013 sec
[au:antunit] Target: testCreateOfOutOfDate took 4.019 sec
[au:antunit] Target: testFileSetPermissionsWin took 0.012 sec
[au:antunit] Target: testRemoveLeadingSlashes took 0.01 sec
[au:antunit] Target: testPrefixWithSlash took 0.012 sec
[au:antunit] Target: testWithImplicitDirectories took 0.012 sec
[au:antunit] Target: testForceReplaceOfUpToDate took 4.031 sec
[au:antunit] Target: test0PermissionsGetReplaced took 0.027 sec
[au:antunit] Target: testFailDuplicates took 0.005 sec
[au:antunit] Build File: /srv/gump/public/workspace/antlibs-compress/src/tests/antunit/cpioentry-test.xml
[au:antunit] Tests run: 2, Failures: 0, Errors: 0, Time elapsed: 0.209 sec
[au:antunit] Target: testCpioSource took 0.005 sec
[au:antunit] Target: testResourceProperties took 0.025 sec
[au:antunit] Build File: /srv/gump/public/workspace/antlibs-compress/src/tests/antunit/cpiofileset-test.xml
[au:antunit] Tests run: 5, Failures: 0, Errors: 0, Time elapsed: 0.064 sec
[au:antunit] Target: testMissingArchive took 0.008 sec
[au:antunit] Target: testUncompressSource took 0.014 sec
[au:antunit] Target: test-refid-check-encoding took 0.009 sec
[au:antunit] Target: testCpioSource took 0.011 sec
[au:antunit] Target: testMissingArchiveDoesntMatter took 0.003 sec
[au:antunit] Build File: /srv/gump/public/workspace/antlibs-compress/src/tests/antunit/dumpentry-test.xml
[au:antunit] Tests run: 1, Failures: 0, Errors: 0, Time elapsed: 0.056 sec
[au:antunit] Target: testDumpSource took 0.03 sec
[au:antunit] Build File: /srv/gump/public/workspace/antlibs-compress/src/tests/antunit/dumpfileset-test.xml
[au:antunit] Tests run: 5, Failures: 0, Errors: 0, Time elapsed: 0.088 sec
[au:antunit] Target: testMissingArchive took 0.006 sec
[au:antunit] Target: testUncompressSource took 0.022 sec
[au:antunit] Target: test-refid-check-encoding took 0.007 sec
[au:antunit] Target: testDumpSource took 0.012 sec
[au:antunit] Target: testMissingArchiveDoesntMatter took 0.008 sec
[au:antunit] Build File: /srv/gump/public/workspace/antlibs-compress/src/tests/antunit/gunzip-test.xml
[au:antunit] Tests run: 10, Failures: 0, Errors: 0, Time elapsed: 0.395 sec
[au:antunit] Target: test2 took 0.01 sec
[au:antunit] Target: test1 took 0.003 sec
[au:antunit] Target: testNativeGzip took 0.008 sec
[au:antunit] Target: testAntlibGzipTask took 0.013 sec
[au:antunit] Target: testConcatenatedStreamsAllStreams took 0.01 sec
[au:antunit] Target: testCoreGzipTask took 0.02 sec
[au:antunit] Target: testWithResource took 0.004 sec
[au:antunit] Target: testConcatenatedStreamsOnlyFirstStream took 0.004 sec
[au:antunit] Target: testConcatenatedStreamsDefault took 0.012 sec
[au:antunit] Target: testAntlibGzipTaskWithLevel took 0.004 sec
[au:antunit] Build File: /srv/gump/public/workspace/antlibs-compress/src/tests/antunit/gzip-test.xml
[au:antunit] Tests run: 8, Failures: 0, Errors: 0, Time elapsed: 0.252 sec
[au:antunit] Target: testDateCheck took 0.013 sec
[au:antunit] Target: testFailTwo took 0.004 sec
[au:antunit] Target: testRealTestWithResource took 0.004 sec
[au:antunit] Target: testFailTwoDests took 0.003 sec
[au:antunit] Target: testFailNoDest took 0.003 sec
[au:antunit] Target: testFailNone took 0.003 sec
[au:antunit] Target: testNestedTask took 0.038 sec
[au:antunit] Target: testRealTest took 0.013 sec
[au:antunit] Build File: /srv/gump/public/workspace/antlibs-compress/src/tests/antunit/gzipresource-test.xml
[au:antunit] Tests run: 4, Failures: 0, Errors: 0, Time elapsed: 0.105 sec
[au:antunit] Target: testNativeGZip took 0.005 sec
[au:antunit] Target: testConcatenatedStreamsAllStreams took 0.004 sec
[au:antunit] Target: testConcatenatedStreamsOnlyFirstStream took 0.004 sec
[au:antunit] Target: testConcatenatedStreamsDefault took 0.004 sec
[au:antunit] Build File: /srv/gump/public/workspace/antlibs-compress/src/tests/antunit/lzmaresource-test.xml
[au:antunit] Tests run: 1, Failures: 0, Errors: 0, Time elapsed: 0.032 sec
[au:antunit] Target: testNativeLZMA took 0.021 sec
[au:antunit] Build File: /srv/gump/public/workspace/antlibs-compress/src/tests/antunit/pack200-test.xml
[au:antunit] Tests run: 7, Failures: 0, Errors: 0, Time elapsed: 3.522 sec
[au:antunit] Target: testDateCheck took 2.894 sec
[au:antunit] Target: testProperties took 0.092 sec
[au:antunit] Target: testRealTestWithResource took 0.037 sec
[au:antunit] Target: testNestedTask took 0.064 sec
[au:antunit] Target: testTempFileStrategy took 0.065 sec
[au:antunit] Target: testNestingOfPackTasks took 0.048 sec
[au:antunit] Target: testRealTest took 0.294 sec
[au:antunit] Build File: /srv/gump/public/workspace/antlibs-compress/src/tests/antunit/pack200normalize-test.xml
[au:antunit] Tests run: 9, Failures: 0, Errors: 0, Time elapsed: 8.214 sec
[au:antunit] Target: testNormalizeDoesntDoAnythingWhenTargetIsUpToDate took 0.008 sec
[au:antunit] Target: testNormalizeSelfWithoutForceDoesntDoAnything took 0.003 sec
[au:antunit] Target: testSrcfileIsRequired took 0.004 sec
[au:antunit] Target: testNormalizeNonExistantTarget took 2.02 sec
[au:antunit] Target: testNormalizeSelfWithForce took 2.028 sec
[au:antunit] Target: testDestfileMustNotBeADirectory took 0.005 sec
[au:antunit] Target: testNormalizesOutOfDateTarget took 4.011 sec
[au:antunit] Target: testSrcfileMustNotBeADirectory took 0.004 sec
[au:antunit] Target: testSrcfileMustExist took 0.003 sec
[au:antunit] Build File: /srv/gump/public/workspace/antlibs-compress/src/tests/antunit/pack200resource-test.xml
[au:antunit] Tests run: 2, Failures: 0, Errors: 0, Time elapsed: 0.061 sec
[au:antunit] Target: testDoesntSupportConcatenatedStreams took 0.033 sec
[au:antunit] Target: testNativePack200 took 0.02 sec
[au:antunit] Build File: /srv/gump/public/workspace/antlibs-compress/src/tests/antunit/sevenz-test.xml
[au:antunit] Tests run: 28, Failures: 2, Errors: 0, Time elapsed: 35.366 sec
[au:antunit] Target: testPlainFileSetWithFilter took 0.122 sec
[au:antunit] Target: testUpdateOfOutOfDate took 4.677 sec
[au:antunit] Target: testPreserveDuplicates took 0.056 sec
[au:antunit] Target: testSevenzFileSet took 0.079 sec
[au:antunit] Target: testCreateOfUpToDate took 4.281 sec
[au:antunit] Target: testThrowsWhenAddingMethodViaAttributeAndNestedElements took 0.005 sec
[au:antunit] Target: testFailDuplicates took 0.004 sec
[au:antunit] Target: testWithImplicitDirectories took 0.044 sec
[au:antunit] Target: testPlainFileSet took 0.029 sec
[au:antunit] Target: testPreserveLeadingSlashes took 0.04 sec
[au:antunit] Target: testSkipEmpty took 0.003 sec
[au:antunit] Target: testCreateOfOutOfDate took 4.207 sec
[au:antunit] Target: testAddDuplicates took 0.04 sec
[au:antunit] Target: testReplaceOfOutOfDate took 4.365 sec
[au:antunit] Target: testAntlibZipFileSet  FAILED
[au:antunit] 	at line 34, column 24
[au:antunit] 	Message: Assertion failed
[au:antunit] 	took 0.026 sec
[au:antunit] Target: testUpdateOfUpToDate took 4.164 sec
[au:antunit] Target: testNoDirectoriesByDefault took 0.051 sec
[au:antunit] Target: testForceCreateOfUpToDate took 4.287 sec
[au:antunit] Target: testFullpath took 0.035 sec
[au:antunit] Target: testFailEmpty took 0.003 sec
[au:antunit] Target: testPrefixWithBackslash took 0.043 sec
[au:antunit] Target: testPrefixWithSlash took 0.035 sec
[au:antunit] Target: testForceReplaceOfUpToDate took 4.328 sec
[au:antunit] Target: testReplaceOfUpToDate took 4.248 sec
[au:antunit] Target: testPrefixWithoutSlash took 0.034 sec
[au:antunit] Target: testWithDirectories took 0.01 sec
[au:antunit] Target: testCoreZipFileSet  FAILED
[au:antunit] 	at line 34, column 24
[au:antunit] 	Message: Assertion failed
[au:antunit] 	took 0.026 sec
[au:antunit] Target: testRemoveLeadingSlashes took 0.038 sec
[au:antunit] Build File: /srv/gump/public/workspace/antlibs-compress/src/tests/antunit/sevenzentry-test.xml
[au:antunit] Tests run: 2, Failures: 0, Errors: 0, Time elapsed: 0.02 sec
[au:antunit] Target: testFileSource took 0.01 sec
[au:antunit] Target: testResourceProperties took 0.008 sec
[au:antunit] Build File: /srv/gump/public/workspace/antlibs-compress/src/tests/antunit/sevenzfileset-test.xml
[au:antunit] Tests run: 6, Failures: 0, Errors: 0, Time elapsed: 0.041 sec
[au:antunit] Target: testMissingArchive took 0.003 sec
[au:antunit] Target: test-refid-check-encoding took 0.002 sec
[au:antunit] Target: test-refid-modify took 0.019 sec

Continuation...

[au:antunit] Target: testSevenZSource took 0.006 sec
[au:antunit] Target: test-refid-check-prefix took 0.002 sec
[au:antunit] Target: testMissingArchiveDoesntMatter took 0.002 sec
[au:antunit] Build File: /srv/gump/public/workspace/antlibs-compress/src/tests/antunit/snappyresource-test.xml
[au:antunit] Tests run: 2, Failures: 0, Errors: 0, Time elapsed: 0.038 sec
[au:antunit] Target: testNativeSnappyUnframed took 0.007 sec
[au:antunit] Target: testNativeSnappy took 0.006 sec
[au:antunit] Build File: /srv/gump/public/workspace/antlibs-compress/src/tests/antunit/tar-test.xml
[au:antunit] Tests run: 38, Failures: 2, Errors: 0, Time elapsed: 32.499 sec
[au:antunit] Target: testNonFileDest took 0.009 sec
[au:antunit] Target: testPaxLongFile took 0.017 sec
[au:antunit] Target: testPrefixWithoutSlash took 0.012 sec
[au:antunit] Target: testCreateOfUpToDate took 4.009 sec
[au:antunit] Target: testExplicitUstarLongFile took 0.005 sec
[au:antunit] Target: testArFileSet took 0.01 sec
[au:antunit] Target: testCpioFileSet took 0.01 sec
[au:antunit] Target: testPreserveDuplicates took 0.004 sec
[au:antunit] Target: testFailEmpty took 0.002 sec
[au:antunit] Target: testCoreTarFileSet took 0.022 sec
[au:antunit] Target: testPreserveLeadingSlashes took 0.017 sec
[au:antunit] Target: testAntlibZipFileSet  FAILED
[au:antunit] 	at line 39, column 24
[au:antunit] 	Message: Assertion failed
[au:antunit] 	took 0.009 sec
[au:antunit] Target: testPrefixWithBackslash took 0.009 sec
[au:antunit] Target: testImplicitDirectoriesUsePermissions took 0.003 sec
[au:antunit] Target: testReplaceOfOutOfDate took 4.017 sec
[au:antunit] Target: testUpdateOfUpToDate took 4.009 sec
[au:antunit] Target: testUpdateOfOutOfDate took 4.019 sec
[au:antunit] Target: testImplicitUstarLongFile took 0.003 sec
[au:antunit] Target: testSkipEmpty took 0.003 sec
[au:antunit] Target: testWithDirectories took 0.016 sec
[au:antunit] Target: testFullpath took 0.01 sec
[au:antunit] Target: testPreserve0Permissions took 0.011 sec
[au:antunit] Target: testForceCreateOfUpToDate took 4.013 sec
[au:antunit] Target: testNoDirectoriesByDefault took 0.009 sec
[au:antunit] Target: testPlainFileSet took 0.01 sec
[au:antunit] Target: testReplaceOfUpToDate took 4.008 sec
[au:antunit] Target: testCoreZipFileSet  FAILED
[au:antunit] 	at line 39, column 24
[au:antunit] 	Message: Assertion failed
[au:antunit] 	took 0.01 sec
[au:antunit] Target: testAntlibTarFileSet took 0.01 sec
[au:antunit] Target: testCreateOfOutOfDate took 4.021 sec
[au:antunit] Target: testFileSetPermissionsWin took 0.011 sec
[au:antunit] Target: testOldgnuLongFile took 0.014 sec
[au:antunit] Target: testAddDuplicates took 0.004 sec
[au:antunit] Target: testRemoveLeadingSlashes took 0.009 sec
[au:antunit] Target: testPrefixWithSlash took 0.011 sec
[au:antunit] Target: testWithImplicitDirectories took 0.01 sec
[au:antunit] Target: testForceReplaceOfUpToDate took 4.022 sec
[au:antunit] Target: test0PermissionsGetReplaced took 0.014 sec
[au:antunit] Target: testFailDuplicates took 0.003 sec
[au:antunit] Build File: /srv/gump/public/workspace/antlibs-compress/src/tests/antunit/tarentry-test.xml
[au:antunit] Tests run: 3, Failures: 0, Errors: 0, Time elapsed: 0.018 sec
[au:antunit] Target: testResourceProperties took 0.009 sec
[au:antunit] Target: testUncompressSource took 0.004 sec
[au:antunit] Target: testTarSource took 0.002 sec
[au:antunit] Build File: /srv/gump/public/workspace/antlibs-compress/src/tests/antunit/tarfileset-test.xml
[au:antunit] Tests run: 5, Failures: 0, Errors: 0, Time elapsed: 0.082 sec
[au:antunit] Target: testMissingArchive took 0.002 sec
[au:antunit] Target: testUncompressSource took 0.003 sec
[au:antunit] Target: testTarSource took 0.003 sec
[au:antunit] Target: test-refid-check-encoding took 0.002 sec
[au:antunit] Target: testMissingArchiveDoesntMatter took 0.067 sec
[au:antunit] Build File: /srv/gump/public/workspace/antlibs-compress/src/tests/antunit/un7z-test.xml
[au:antunit] Tests run: 7, Failures: 0, Errors: 0, Time elapsed: 0.193 sec
[au:antunit] Target: testAgainstAntlib7zTask took 0.019 sec
[au:antunit] Target: testAgainstAntlib7zTaskDeltaPlusLZMA2 took 0.018 sec
[au:antunit] Target: testAgainstAntlib7zTaskBZIP2 took 0.013 sec
[au:antunit] Target: testAgainstAntlib7zTaskDeflate took 0.005 sec
[au:antunit] Target: testAgainstNative7z took 0.007 sec
[au:antunit] Target: testAgainstAntlib7zTaskLZMA2 took 0.117 sec
[au:antunit] Target: testAgainstAntlib7zTaskCopy took 0.004 sec
[au:antunit] Build File: /srv/gump/public/workspace/antlibs-compress/src/tests/antunit/unar-test.xml
[au:antunit] Tests run: 2, Failures: 0, Errors: 0, Time elapsed: 0.008 sec
[au:antunit] Target: testAgainstNativeAr took 0.004 sec
[au:antunit] Target: testAgainstAntlibArTask took 0.003 sec
[au:antunit] Build File: /srv/gump/public/workspace/antlibs-compress/src/tests/antunit/unarj-test.xml
[au:antunit] Tests run: 2, Failures: 0, Errors: 0, Time elapsed: 0.015 sec
[au:antunit] Target: testResourceCollection took 0.008 sec
[au:antunit] Target: testAgainstNativeArj took 0.005 sec
[au:antunit] Build File: /srv/gump/public/workspace/antlibs-compress/src/tests/antunit/uncpio-test.xml
[au:antunit] Tests run: 8, Failures: 0, Errors: 0, Time elapsed: 0.076 sec
[au:antunit] Target: testAgainstNativeCpioBinary took 0.003 sec
[au:antunit] Target: testAgainstNativeCpioCRC took 0.004 sec
[au:antunit] Target: testAgainstAntlibCpioTaskBinary took 0.01 sec
[au:antunit] Target: testAgainstAntlibCpioTaskOldAscii took 0.016 sec
[au:antunit] Target: testAgainstNativeCpioOldAscii took 0.003 sec
[au:antunit] Target: testAgainstNativeCpioNewAscii took 0.003 sec
[au:antunit] Target: testResourceCollection took 0.008 sec
[au:antunit] Target: testAgainstAntlibCpioTaskNewAscii took 0.018 sec
[au:antunit] Build File: /srv/gump/public/workspace/antlibs-compress/src/tests/antunit/undump-test.xml
[au:antunit] Tests run: 3, Failures: 0, Errors: 0, Time elapsed: 0.024 sec
[au:antunit] Target: testAgainstNativeDump took 0.003 sec
[au:antunit] Target: testResourceCollection took 0.013 sec
[au:antunit] Target: testAgainstNativeDumpCompressed took 0.002 sec
[au:antunit] Build File: /srv/gump/public/workspace/antlibs-compress/src/tests/antunit/unlzma-test.xml
[au:antunit] Tests run: 4, Failures: 0, Errors: 0, Time elapsed: 0.055 sec
[au:antunit] Target: test2 took 0.003 sec
[au:antunit] Target: test1 took 0.002 sec
[au:antunit] Target: testNativeLZMA took 0.003 sec
[au:antunit] Target: testWithResource took 0.003 sec
[au:antunit] Build File: /srv/gump/public/workspace/antlibs-compress/src/tests/antunit/unpack200-test.xml
[au:antunit] Tests run: 5, Failures: 0, Errors: 0, Time elapsed: 0.098 sec
[au:antunit] Target: testAgainstNativePack200 took 0.029 sec
[au:antunit] Target: testAgainstPack200Task took 0.017 sec
[au:antunit] Target: testProperties took 0.015 sec
[au:antunit] Target: testDoesntSupportConcatenatedStreams took 0.014 sec
[au:antunit] Target: testTempFileStrategy took 0.016 sec
[au:antunit] Build File: /srv/gump/public/workspace/antlibs-compress/src/tests/antunit/unsnappy-test.xml
[au:antunit] Tests run: 6, Failures: 0, Errors: 0, Time elapsed: 0.079 sec
[au:antunit] Target: test2 took 0.002 sec
[au:antunit] Target: test1 took 0.001 sec
[au:antunit] Target: testNativeSnappy took 0.003 sec
[au:antunit] Target: testNativeSnappyUnframed took 0.002 sec
[au:antunit] Target: testWithResource took 0.004 sec
[au:antunit] Target: testWithResourceUnframed took 0.002 sec
[au:antunit] Build File: /srv/gump/public/workspace/antlibs-compress/src/tests/antunit/untar-test.xml
[au:antunit] Tests run: 4, Failures: 0, Errors: 0, Time elapsed: 0.031 sec
[au:antunit] Target: testAgainstAntlibTarTask took 0.01 sec
[au:antunit] Target: testAgainstCoreTarTask took 0.011 sec
[au:antunit] Target: testResourceCollection took 0.004 sec
[au:antunit] Target: testAgainstNativeTar took 0.002 sec
[au:antunit] Build File: /srv/gump/public/workspace/antlibs-compress/src/tests/antunit/unxz-test.xml
[au:antunit] Tests run: 8, Failures: 0, Errors: 0, Time elapsed: 0.262 sec
[au:antunit] Target: test2 took 0.002 sec
[au:antunit] Target: test1 took 0.002 sec
[au:antunit] Target: testXZTask took 0.149 sec
[au:antunit] Target: testConcatenatedStreamsAllStreams took 0.006 sec
[au:antunit] Target: testNativeXZ took 0.007 sec
[au:antunit] Target: testWithResource took 0.005 sec
[au:antunit] Target: testConcatenatedStreamsOnlyFirstStream took 0.003 sec
[au:antunit] Target: testConcatenatedStreamsDefault took 0.003 sec
[au:antunit] Build File: /srv/gump/public/workspace/antlibs-compress/src/tests/antunit/unz-test.xml
[au:antunit] Tests run: 4, Failures: 0, Errors: 0, Time elapsed: 0.056 sec
[au:antunit] Target: test2 took 0.003 sec
[au:antunit] Target: test1 took 0.001 sec
[au:antunit] Target: testNativeZ took 0.006 sec
[au:antunit] Target: testWithResource took 0.003 sec
[au:antunit] Build File: /srv/gump/public/workspace/antlibs-compress/src/tests/antunit/unzip-test.xml
[au:antunit] Tests run: 7, Failures: 0, Errors: 0, Time elapsed: 0.062 sec
[au:antunit] Target: testSkipUnreadableEntries took 0.007 sec
[au:antunit] Target: testAgainstAntlibZipTask took 0.017 sec
[au:antunit] Target: testStrippingOfPathsep took 0.003 sec
[au:antunit] Target: testAgainstNativeZip took 0.002 sec
[au:antunit] Target: testAgainstCoreZipTask took 0.018 sec
[au:antunit] Target: testResourceCollection took 0.004 sec
[au:antunit] Target: testFailsOnUnreadableEntries took 0.002 sec
[au:antunit] Build File: /srv/gump/public/workspace/antlibs-compress/src/tests/antunit/xz-test.xml
[au:antunit] Tests run: 8, Failures: 0, Errors: 0, Time elapsed: 0.702 sec
[au:antunit] Target: testDateCheck took 0.003 sec
[au:antunit] Target: testFailTwo took 0.002 sec
[au:antunit] Target: testRealTestWithResource took 0.44 sec
[au:antunit] Target: testFailTwoDests took 0.003 sec
[au:antunit] Target: testFailNoDest took 0.002 sec
[au:antunit] Target: testFailNone took 0.002 sec
[au:antunit] Target: testNestedTask took 0.064 sec
[au:antunit] Target: testRealTest took 0.083 sec
[au:antunit] Build File: /srv/gump/public/workspace/antlibs-compress/src/tests/antunit/xzresource-test.xml
[au:antunit] Tests run: 4, Failures: 0, Errors: 0, Time elapsed: 0.058 sec
[au:antunit] Target: testConcatenatedStreamsAllStreams took 0.006 sec
[au:antunit] Target: testNativeXZ took 0.004 sec
[au:antunit] Target: testConcatenatedStreamsOnlyFirstStream took 0.004 sec
[au:antunit] Target: testConcatenatedStreamsDefault took 0.003 sec
[au:antunit] Build File: /srv/gump/public/workspace/antlibs-compress/src/tests/antunit/zip-test.xml
[au:antunit] Tests run: 39, Failures: 2, Errors: 0, Time elapsed: 63.799 sec
[au:antunit] Target: testNonFileDest took 0.006 sec
[au:antunit] Target: testPrefixWithoutSlash took 0.01 sec
[au:antunit] Target: testBigArchiveWithZip64 took 31.166 sec
[au:antunit] Target: testCreateOfUpToDate took 4.009 sec
[au:antunit] Target: testBigArchiveWithoutZip64 took 0.003 sec
[au:antunit] Target: testArFileSet took 0.01 sec
[au:antunit] Target: testCpioFileSet took 0.01 sec
[au:antunit] Target: testPreserveDuplicates took 0.003 sec
[au:antunit] Target: testFailEmpty took 0.003 sec
[au:antunit] Target: testCoreTarFileSet took 0.01 sec
[au:antunit] Target: testPreserveLeadingSlashes took 0.009 sec
[au:antunit] Target: testAntlibZipFileSet  FAILED
[au:antunit] 	at line 35, column 24
[au:antunit] 	Message: Assertion failed
[au:antunit] 	took 0.01 sec
[au:antunit] Target: testComment took 0.003 sec
[au:antunit] Target: testPrefixWithBackslash took 0.009 sec
[au:antunit] Target: testLevel took 0.006 sec
[au:antunit] Target: testImplicitDirectoriesUsePermissions took 0.004 sec
[au:antunit] Target: testReplaceOfOutOfDate took 4.023 sec
[au:antunit] Target: testRoundDown took 0.01 sec
[au:antunit] Target: testUpdateOfUpToDate took 4.009 sec
[au:antunit] Target: testUpdateOfOutOfDate took 4.023 sec
[au:antunit] Target: testSkipEmpty took 0.003 sec
[au:antunit] Target: testWithDirectories took 0.01 sec
[au:antunit] Target: testFullpath took 0.01 sec
[au:antunit] Target: testPreserve0Permissions took 0.01 sec
[au:antunit] Target: testForceCreateOfUpToDate took 4.019 sec
[au:antunit] Target: testNoDirectoriesByDefault took 0.023 sec
[au:antunit] Target: testPlainFileSet took 0.01 sec
[au:antunit] Target: testReplaceOfUpToDate took 4.015 sec
[au:antunit] Target: testCoreZipFileSet  FAILED
[au:antunit] 	at line 35, column 24
[au:antunit] 	Message: Assertion failed
[au:antunit] 	took 0.011 sec
[au:antunit] Target: testAntlibTarFileSet took 0.172 sec
[au:antunit] Target: testCreateOfOutOfDate took 4.018 sec
[au:antunit] Target: testFileSetPermissionsWin took 0.012 sec
[au:antunit] Target: testAddDuplicates took 0.011 sec
[au:antunit] Target: testRemoveLeadingSlashes took 0.009 sec
[au:antunit] Target: testPrefixWithSlash took 0.009 sec
[au:antunit] Target: testWithImplicitDirectories took 0.009 sec
[au:antunit] Target: testForceReplaceOfUpToDate took 4.024 sec
[au:antunit] Target: test0PermissionsGetReplaced took 0.01 sec
[au:antunit] Target: testFailDuplicates took 0.003 sec
[au:antunit] Build File: /srv/gump/public/workspace/antlibs-compress/src/tests/antunit/zipentry-test.xml
[au:antunit] Tests run: 3, Failures: 1, Errors: 0, Time elapsed: 0.026 sec
[au:antunit] Target: testResourceProperties  FAILED
[au:antunit] 	at line 59, column 20
[au:antunit] 	Message: Assertion failed
[au:antunit] 	took 0.01 sec
[au:antunit] Target: testUncompressSource took 0.004 sec
[au:antunit] Target: testZipSource took 0.004 sec
[au:antunit] Build File: /srv/gump/public/workspace/antlibs-compress/src/tests/antunit/zipfileset-test.xml
[au:antunit] Tests run: 9, Failures: 0, Errors: 0, Time elapsed: 0.054 sec
[au:antunit] Target: testSkipUnreadableEntries took 0.004 sec
[au:antunit] Target: testMissingArchive took 0.002 sec
[au:antunit] Target: testUncompressSource took 0.003 sec
[au:antunit] Target: test-refid-check-encoding took 0.002 sec
[au:antunit] Target: testZipSource took 0.002 sec
[au:antunit] Target: test-refid-modify took 0.025 sec
[au:antunit] Target: test-refid-check-prefix took 0.001 sec
[au:antunit] Target: testMissingArchiveDoesntMatter took 0.002 sec
[au:antunit] Target: testFailsOnUnreadableEntries took 0.003 sec
[au:antunit] Build File: /srv/gump/public/workspace/antlibs-compress/src/tests/antunit/zresource-test.xml
[au:antunit] Tests run: 1, Failures: 0, Errors: 0, Time elapsed: 0.015 sec
[au:antunit] Target: testNativeZ took 0.004 sec

test:

BUILD FAILED
/srv/gump/public/workspace/antlibs-compress/common/build.xml:209: At least one AntUnit test has failed.

Total time: 3 minutes 36 seconds

Apache Gump, Gump, Apache, the Apache feather logo, and the Apache Gump project logos are trademarks of The Apache Software Foundation.

Last Updated: Fri, 24 Mar 2017 12:00:05 ().Python Logo